rultor.com logo This build log was produced by rultor.com for zerocracy/farm#909
+ set -e
+ set -o pipefail
++ dirname ./run.sh
+ cd .
+ echo 30535
+ echo '1.67.2 b60448e97'
1.67.2 b60448e97
+ date
Wed Apr 11 08:48:26 CEST 2018
+ uptime
 08:48:26 up 17 days, 12:21,  0 users,  load average: 0.00, 0.01, 0.19
+ head=git@github.com:zerocracy/farm.git
+ ff=default
+ image=yegor256/java8
+ rebase=false
+ squash=false
+ head_branch=master
+ author=yegor256
+ tag=0.21.2
+ vars=('--env=MAVEN_OPTS=-XX:MaxPermSize=256m -Xmx1g' '--env=head=git@github.com:zerocracy/farm.git' '--env=tag=0.21.2' '--env=scripts=( '\''export '\''\'\'''\''MAVEN_OPTS=-XX:MaxPermSize=256m -Xmx1g'\''\'\'''\'''\'' '\'';'\'' '\''export '\''\'\'''\''head=git@github.com:zerocracy/farm.git'\''\'\'''\'''\'' '\'';'\'' '\''export '\''\'\'''\''tag=0.21.2'\''\'\'''\'''\'' '\'';'\'' '\''export '\''\'\'''\''head_branch=master'\''\'\'''\'''\'' '\'';'\'' '\''export '\''\'\'''\''author=yegor256'\''\'\'''\'''\'' '\'';'\'' '\''sudo apt-key adv --keyserver hkp://keyserver.ubuntu.com:80 --recv 0C49F3730359A14518585931BC711F9BA15703C6'\'' '\'';'\'' '\''echo "deb [ arch=amd64 ] http://repo.mongodb.org/apt/ubuntu trusty/mongodb-org/3.4 multiverse" | sudo tee /etc/apt/sources.list.d/mongodb-org-3.4.list'\'' '\'';'\'' '\''sudo apt-get update'\'' '\'';'\'' '\''sudo apt-get install -y mongodb-org'\'' '\'';'\'' '\''sudo gem install pdd'\'' '\'';'\'' '\''sudo gem install xcop'\'' '\'';'\'' '\''sudo gem install sass -v 3.4.25'\'' '\'';'\'' '\''java -version'\'' '\'';'\'' '\''[[ "${tag}" =~ ^[0-9]+(\.[0-9]+)*$ ]] || exit -1'\'' '\'';'\'' '\''mvn clean process-resources --quiet'\'' '\'';'\'' '\''mvn clean versions:set "-DnewVersion=${tag}" --quiet'\'' '\'';'\'' '\''git commit -am "${tag}"'\'' '\'';'\'' '\''cp ../settings.xml settings.xml'\'' '\'';'\'' '\''mvn clean package -Pqulice -Pzc-farm --errors --batch-mode --quiet'\'' '\'';'\'' '\''git remote add heroku git@heroku.com:zerocrat.git'\'' '\'';'\'' '\''mkdir ~/.ssh'\'' '\'';'\'' '\''mv ../id_rsa ../id_rsa.pub ~/.ssh'\'' '\'';'\'' '\''chmod -R 600 ~/.ssh/*'\'' '\'';'\'' '\''echo -e "Host *\n  StrictHostKeyChecking no\n  UserKnownHostsFile=/dev/null" > ~/.ssh/config'\'' '\'';'\'' '\''git fetch'\'' '\'';'\'' '\''git add settings.xml'\'' '\'';'\'' '\''mvn initialize -Pshutdown --settings ../settings.xml'\'' '\'';'\'' '\''git commit -m '\''\'\'''\''settings.xml'\''\'\'''\'' && git push -f heroku $(git symbolic-ref --short HEAD):master && git reset HEAD~1'\'' '\'';'\'' '\''curl -f --connect-timeout 15 --retry 5 --retry-delay 30 https://www.0crat.com > /dev/null'\'' '\'';'\'' )' '--env=head_branch=master' '--env=author=yegor256')
+ scripts=('export '\''MAVEN_OPTS=-XX:MaxPermSize=256m -Xmx1g'\''' ';' 'export '\''head=git@github.com:zerocracy/farm.git'\''' ';' 'export '\''tag=0.21.2'\''' ';' 'export '\''head_branch=master'\''' ';' 'export '\''author=yegor256'\''' ';' 'sudo apt-key adv --keyserver hkp://keyserver.ubuntu.com:80 --recv 0C49F3730359A14518585931BC711F9BA15703C6' ';' 'echo "deb [ arch=amd64 ] http://repo.mongodb.org/apt/ubuntu trusty/mongodb-org/3.4 multiverse" | sudo tee /etc/apt/sources.list.d/mongodb-org-3.4.list' ';' 'sudo apt-get update' ';' 'sudo apt-get install -y mongodb-org' ';' 'sudo gem install pdd' ';' 'sudo gem install xcop' ';' 'sudo gem install sass -v 3.4.25' ';' 'java -version' ';' '[[ "${tag}" =~ ^[0-9]+(\.[0-9]+)*$ ]] || exit -1' ';' 'mvn clean process-resources --quiet' ';' 'mvn clean versions:set "-DnewVersion=${tag}" --quiet' ';' 'git commit -am "${tag}"' ';' 'cp ../settings.xml settings.xml' ';' 'mvn clean package -Pqulice -Pzc-farm --errors --batch-mode --quiet' ';' 'git remote add heroku git@heroku.com:zerocrat.git' ';' 'mkdir ~/.ssh' ';' 'mv ../id_rsa ../id_rsa.pub ~/.ssh' ';' 'chmod -R 600 ~/.ssh/*' ';' 'echo -e "Host *\n  StrictHostKeyChecking no\n  UserKnownHostsFile=/dev/null" > ~/.ssh/config' ';' 'git fetch' ';' 'git add settings.xml' ';' 'mvn initialize -Pshutdown --settings ../settings.xml' ';' 'git commit -m '\''settings.xml'\'' && git push -f heroku $(git symbolic-ref --short HEAD):master && git reset HEAD~1' ';' 'curl -f --connect-timeout 15 --retry 5 --retry-delay 30 https://www.0crat.com > /dev/null' ';')
+ directory=
+ container=zerocracy_farm_909
+ as_root=false
+ mkdir -p /home/rultor/.ssh
+ echo -e 'Host github.com\n\tStrictHostKeyChecking no\n'
+ chmod 600 /home/rultor/.ssh/config
+ git clone git@github.com:zerocracy/farm.git repo
Cloning into 'repo'...
+ cd repo
+ git config user.email me@rultor.com
+ git config user.name rultor
+ '[' -z 'export '\''MAVEN_OPTS=-XX:MaxPermSize=256m -Xmx1g'\''' ']'
+ cd ..
+ cat
+ '[' false = true ']'
+ cat
+ chmod a+x entry.sh
+ cat
+ echo 'export '\''MAVEN_OPTS=-XX:MaxPermSize=256m -Xmx1g'\''' ';' 'export '\''head=git@github.com:zerocracy/farm.git'\''' ';' 'export '\''tag=0.21.2'\''' ';' 'export '\''head_branch=master'\''' ';' 'export '\''author=yegor256'\''' ';' 'sudo apt-key adv --keyserver hkp://keyserver.ubuntu.com:80 --recv 0C49F3730359A14518585931BC711F9BA15703C6' ';' 'echo "deb [ arch=amd64 ] http://repo.mongodb.org/apt/ubuntu trusty/mongodb-org/3.4 multiverse" | sudo tee /etc/apt/sources.list.d/mongodb-org-3.4.list' ';' 'sudo apt-get update' ';' 'sudo apt-get install -y mongodb-org' ';' 'sudo gem install pdd' ';' 'sudo gem install xcop' ';' 'sudo gem install sass -v 3.4.25' ';' 'java -version' ';' '[[ "${tag}" =~ ^[0-9]+(\.[0-9]+)*$ ]] || exit -1' ';' 'mvn clean process-resources --quiet' ';' 'mvn clean versions:set "-DnewVersion=${tag}" --quiet' ';' 'git commit -am "${tag}"' ';' 'cp ../settings.xml settings.xml' ';' 'mvn clean package -Pqulice -Pzc-farm --errors --batch-mode --quiet' ';' 'git remote add heroku git@heroku.com:zerocrat.git' ';' 'mkdir ~/.ssh' ';' 'mv ../id_rsa ../id_rsa.pub ~/.ssh' ';' 'chmod -R 600 ~/.ssh/*' ';' 'echo -e "Host *\n  StrictHostKeyChecking no\n  UserKnownHostsFile=/dev/null" > ~/.ssh/config' ';' 'git fetch' ';' 'git add settings.xml' ';' 'mvn initialize -Pshutdown --settings ../settings.xml' ';' 'git commit -m '\''settings.xml'\'' && git push -f heroku $(git symbolic-ref --short HEAD):master && git reset HEAD~1' ';' 'curl -f --connect-timeout 15 --retry 5 --retry-delay 30 https://www.0crat.com > /dev/null' ';'
+ rm -rf .gpg
+ '[' -z 0.21.2 ']'
+ [[ 0.21.2 =~ ^[a-zA-Z0-9\.\-]+$ ]]
+ echo 'tag name is valid: "0.21.2"'
tag name is valid: "0.21.2"
+ cd repo
++ git tag -l 0.21.2
+ '[' ']'
+ export BRANCH_NAME=__rultor
+ BRANCH_NAME=__rultor
++ git show-branch __rultor
++ wc -l
+ '[' 0 -gt 0 ']'
+ git checkout -b __rultor
Switched to a new branch '__rultor'
+ docker_when_possible
+ true
++ uptime
++ sed 's/ /\n/g'
++ tail -n 1
+ load=0.19
++ echo 0.19 '>' 30
++ bc
+ '[' 0 -eq 1 ']'
+ echo 'load average is 0.19, low enough to run a new Docker container'
load average is 0.19, low enough to run a new Docker container
+ break
+ cd ..
+ '[' -n '' ']'
+ use_image=yegor256/java8
+ docker pull yegor256/java8
Using default tag: latest
latest: Pulling from yegor256/java8
Digest: sha256:3fe6561116533e80c10ff859bf612cc8d7fc33a0b2ab5144ef1074546cde2775
Status: Image is up to date for yegor256/java8:latest
+ docker ps --filter=status=exited
+ grep --quiet '\szerocracy_farm_909\s*$'
+ ls -al .
total 72
drwx--x--x  3 rultor rultor  4096 Apr 11 08:48 .
drwxrwxrwt 10 root   root   12288 Apr 11 08:48 ..
-rw-rw-r--  1 rultor rultor   444 Apr 11 08:48 end.sh
-rwxrwxr-x  1 rultor rultor   338 Apr 11 08:48 entry.sh
-rw-rw-r--  1 rultor rultor  1679 Apr 11 08:48 id_rsa
-rw-rw-r--  1 rultor rultor   396 Apr 11 08:48 id_rsa.pub
-rw-rw-r--  1 rultor rultor     6 Apr 11 08:48 pid
drwxrwxr-x  5 rultor rultor  4096 Apr 11 08:48 repo
-rwxrwxr-x  1 rultor rultor  7733 Apr 11 08:48 run.sh
-rw-rw-r--  1 rultor rultor    98 Apr 11 08:48 s3cfg
-rw-rw-r--  1 rultor rultor  1509 Apr 11 08:48 script.sh
-rw-rw-r--  1 rultor rultor  5758 Apr 11 08:48 settings.xml
-rw-rw-r--  1 rultor rultor  7131 Apr 11 08:48 stdout
++ pwd
++ pwd
+ docker run -t --rm -v /tmp/rultor-H0PZ:/main '--env=MAVEN_OPTS=-XX:MaxPermSize=256m -Xmx1g' --env=head=git@github.com:zerocracy/farm.git --env=tag=0.21.2 '--env=scripts=( '\''export '\''\'\'''\''MAVEN_OPTS=-XX:MaxPermSize=256m -Xmx1g'\''\'\'''\'''\'' '\'';'\'' '\''export '\''\'\'''\''head=git@github.com:zerocracy/farm.git'\''\'\'''\'''\'' '\'';'\'' '\''export '\''\'\'''\''tag=0.21.2'\''\'\'''\'''\'' '\'';'\'' '\''export '\''\'\'''\''head_branch=master'\''\'\'''\'''\'' '\'';'\'' '\''export '\''\'\'''\''author=yegor256'\''\'\'''\'''\'' '\'';'\'' '\''sudo apt-key adv --keyserver hkp://keyserver.ubuntu.com:80 --recv 0C49F3730359A14518585931BC711F9BA15703C6'\'' '\'';'\'' '\''echo "deb [ arch=amd64 ] http://repo.mongodb.org/apt/ubuntu trusty/mongodb-org/3.4 multiverse" | sudo tee /etc/apt/sources.list.d/mongodb-org-3.4.list'\'' '\'';'\'' '\''sudo apt-get update'\'' '\'';'\'' '\''sudo apt-get install -y mongodb-org'\'' '\'';'\'' '\''sudo gem install pdd'\'' '\'';'\'' '\''sudo gem install xcop'\'' '\'';'\'' '\''sudo gem install sass -v 3.4.25'\'' '\'';'\'' '\''java -version'\'' '\'';'\'' '\''[[ "${tag}" =~ ^[0-9]+(\.[0-9]+)*$ ]] || exit -1'\'' '\'';'\'' '\''mvn clean process-resources --quiet'\'' '\'';'\'' '\''mvn clean versions:set "-DnewVersion=${tag}" --quiet'\'' '\'';'\'' '\''git commit -am "${tag}"'\'' '\'';'\'' '\''cp ../settings.xml settings.xml'\'' '\'';'\'' '\''mvn clean package -Pqulice -Pzc-farm --errors --batch-mode --quiet'\'' '\'';'\'' '\''git remote add heroku git@heroku.com:zerocrat.git'\'' '\'';'\'' '\''mkdir ~/.ssh'\'' '\'';'\'' '\''mv ../id_rsa ../id_rsa.pub ~/.ssh'\'' '\'';'\'' '\''chmod -R 600 ~/.ssh/*'\'' '\'';'\'' '\''echo -e "Host *\n  StrictHostKeyChecking no\n  UserKnownHostsFile=/dev/null" > ~/.ssh/config'\'' '\'';'\'' '\''git fetch'\'' '\'';'\'' '\''git add settings.xml'\'' '\'';'\'' '\''mvn initialize -Pshutdown --settings ../settings.xml'\'' '\'';'\'' '\''git commit -m '\''\'\'''\''settings.xml'\''\'\'''\'' && git push -f heroku $(git symbolic-ref --short HEAD):master && git reset HEAD~1'\'' '\'';'\'' '\''curl -f --connect-timeout 15 --retry 5 --retry-delay 30 https://www.0crat.com > /dev/null'\'' '\'';'\'' )' --env=head_branch=master --env=author=yegor256 --hostname=docker --privileged --memory=6g --memory-swap=16g --oom-kill-disable --cidfile=/tmp/rultor-H0PZ/cid -w=/main --name=zerocracy_farm_909 yegor256/java8 /main/entry.sh
WARNING: Your kernel does not support swap limit capabilities or the cgroup is not mounted. Memory limited without swap.
+ set -e
+ set -o pipefail
+ shopt -s dotglob
+ useradd -m -G sudo r
+ echo '%sudo ALL=(ALL) NOPASSWD:ALL'
+ cp -R /root/.bashrc /root/.composer /root/.gem /root/.java /root/.m2 /root/.npm /root/.profile /root/texmf /root/tmp /home/r
+ cp -R ./cid ./end.sh ./entry.sh ./id_rsa ./id_rsa.pub ./pid ./repo ./run.sh ./s3cfg ./script.sh ./settings.xml ./stdout /home/r
+ rm -rf repo
+ chown -R r:r /home/r
+ chmod a+x /home/r/script.sh
+ su --login r --command /home/r/script.sh
mesg: /dev/pts/0: Operation not permitted
+ set -e
+ set -o pipefail
+ shopt -s expand_aliases
+ alias 'sudo=sudo -i'
+ export HOME=/home/r
+ HOME=/home/r
+ cd /home/r/repo
+ export 'MAVEN_OPTS=-XX:MaxPermSize=256m -Xmx1g'
+ MAVEN_OPTS='-XX:MaxPermSize=256m -Xmx1g'
+ export head=git@github.com:zerocracy/farm.git
+ head=git@github.com:zerocracy/farm.git
+ export tag=0.21.2
+ tag=0.21.2
+ export head_branch=master
+ head_branch=master
+ export author=yegor256
+ author=yegor256
+ sudo -i apt-key adv --keyserver hkp://keyserver.ubuntu.com:80 --recv 0C49F3730359A14518585931BC711F9BA15703C6
Executing: gpg --ignore-time-conflict --no-options --no-default-keyring --homedir /tmp/tmp.wqA6aVGz2a --no-auto-check-trustdb --trust-model always --keyring /etc/apt/trusted.gpg --primary-keyring /etc/apt/trusted.gpg --keyring /etc/apt/trusted.gpg.d/brightbox-ruby-ng.gpg --keyring /etc/apt/trusted.gpg.d/git-core-ppa.gpg --keyserver hkp://keyserver.ubuntu.com:80 --recv 0C49F3730359A14518585931BC711F9BA15703C6
gpg: requesting key A15703C6 from hkp server keyserver.ubuntu.com
gpg: key A15703C6: public key "MongoDB 3.4 Release Signing Key <packaging@mongodb.com>" imported
gpg: Total number processed: 1
gpg:               imported: 1  (RSA: 1)
+ echo 'deb [ arch=amd64 ] http://repo.mongodb.org/apt/ubuntu trusty/mongodb-org/3.4 multiverse'
+ sudo -i tee /etc/apt/sources.list.d/mongodb-org-3.4.list
stdin: is not a tty
deb [ arch=amd64 ] http://repo.mongodb.org/apt/ubuntu trusty/mongodb-org/3.4 multiverse
+ sudo -i apt-get update
Get:1ohttp://ppa.launchpad.net trusty InRelease [15.4 kB]
Get:2[http://ppa.launchpad.netutrustymInRelease8[15.5)kB]Connecting to8ppa.laun
Ign http://ppa.launchpad.net precise InRelease
Get:3 http://ppa.launchpad.net trusty InRelease [20.8 kB]
Ign http://repo.mongodb.org trusty/mongodb-org/3.4 InRelease
Get:4[http://repo.mongodb.orgBtrusty/mongodb-org/3.4vRelease.gpgm[801.B]9.88.14
Get:5[http://repo.mongodb.orgBtrusty/mongodb-org/3.4vReleaseu[2495(B].189.88.14
Hit%http://ppa.launchpad.netkprecisenRelease.gpgrchive.ubuntu.com (91.189.88.14
Hit%http://ppa.launchpad.netkprecisenReleaseto archive.ubuntu.com (91.189.88.14
Get:6[http://ppa.launchpad.net]trusty/maingamd64rPackagesu[3477oB](91.189.88.14
Get:7[http://ppa.launchpad.net]trusty/maingamd64rPackagesu[3146oB](91.189.88.14
Get:8[http://ppa.launchpad.netutrusty/main.amd648PackagesC[9196tB]g8to8ppa.laun
Get:9 http://repo.mongodb.org trusty/mongodb-org/3.4/multiverse amd64 Packages [10.6 kB]
Hit%http://ppa.launchpad.netuprecise/main1amd648Packages[Connecting1to)ppa.laun
Ign%http://archive.ubuntu.combtrustyoInRelease.88.149)]91.189.88.149)]
Get:10Whttp://archive.ubuntu.com trusty-updates InRelease [65.9 kB]
Get:11Whttp://archive.ubuntu.com trusty-securityaInRelease [65.9 kB]
Hit%http://archive.ubuntu.comktrustyiRelease.gpgaders]             33.0 kB/s 0s
Get:12Whttp://archive.ubuntu.com trusty-updates/main Sources [512 kB].0 kB/s 0s
Get:131http://archive.ubuntu.comgtrusty-updates/restricted Sources3[6449kB]s10s
Get:14Whttp://archive.ubuntu.comgtrusty-updates/universe Sources [250.kB]B/s 0s
Get:15Whttp://archive.ubuntu.comgtrusty-updates/main amd64 Packages3[1330BkB]0s
Get:16Whttp://archive.ubuntu.comitrusty-updates/restricted amd64 PackagesB[21.4 kB]
Get:17Chttp://archive.ubuntu.comttrusty-updates/universe amd64 Packages [581 kB]
Get:181http://archive.ubuntu.comntrusty-security/main Sources [197 kB]4 kB/s 0s
Get:191http://archive.ubuntu.comntrusty-security/restricted Sources [5050BB] 0s
Get:201http://archive.ubuntu.comgtrusty-security/universe Sources [85.8 kB]s 0s
Get:21Whttp://archive.ubuntu.comntrusty-security/main9amd64 Packages3[907BkB]0s
Get:222http://archive.ubuntu.comntrusty-security/restricted amd64 Packages/[18.1 kB]
Get:232http://archive.ubuntu.comntrusty-security/universe]amd64 Packagesk[2840kB]
Hit%http://archive.ubuntu.comitrustyoReleasers]] kB 1%]             334 kB/s 0s
Hit%http://archive.ubuntu.comltrusty/main8Sources                   334 kB/s 0s
Hit%http://archive.ubuntu.com trusty/restricted Sources             334 kB/s 0s
Hit%http://archive.ubuntu.comntrusty/universe Sources               334 kB/s 0s
Hit%http://archive.ubuntu.com trusty/main amd64 Packages            334 kB/s 0s
Hit%http://archive.ubuntu.com trusty/restricted amd64 Packages      334 kB/s 0s
Hit%http://archive.ubuntu.comotrusty/universe amd64 Packages        334 kB/s 0s
Fetchedo4411gkB7in915s](287 kB/s)                                   334 kB/s 0s
Reading package lists... Done
W: Size of file /var/lib/apt/lists/archive.ubuntu.com_ubuntu_dists_trusty-updates_restricted_source_Sources.gz is not what the server reported 6449 6467
W: Size of file /var/lib/apt/lists/archive.ubuntu.com_ubuntu_dists_trusty-security_restricted_source_Sources.gz is not what the server reported 5050 5066
W: Duplicate sources.list entry http://ppa.launchpad.net/git-core/ppa/ubuntu/ trusty/main amd64 Packages (/var/lib/apt/lists/ppa.launchpad.net_git-core_ppa_ubuntu_dists_trusty_main_binary-amd64_Packages.gz)
+ sudo -i apt-get install -y mongodb-org
Reading package lists... Done
Building dependency tree... 50%
Reading state information... Done
The following extra packages will be installed:
  mongodb-org-mongos mongodb-org-server mongodb-org-shell mongodb-org-tools
The following NEW packages will be installed:
  mongodb-org mongodb-org-mongos mongodb-org-server mongodb-org-shell
  mongodb-org-tools
0 upgraded, 5 newly installed, 0 to remove and 176 not upgraded.
Need to get 67.1 MB of archives.
After this operation, 271 MB of additional disk space will be used.
Get:1ohttp://repo.mongodb.org/apt/ubuntu/ trusty/mongodb-org/3.4/multiverse mongodb-org-shell amd64 3.4.14 [7990 kB]
Get:2Whttp://repo.mongodb.org/apt/ubuntu/2trusty/mongodb-org/3.4/multiverse mongodb-org-server amd64 3.4.14 [14.2 MB]
Get:3Whttp://repo.mongodb.org/apt/ubuntu/ trusty/mongodb-org/3.4/multiverse mongodb-org-mongos amd64 3.4.14 [8278 kB]
Get:4Whttp://repo.mongodb.org/apt/ubuntu/0trusty/mongodb-org/3.4/multiverse mongodb-org-tools amd64 3.4.14 [36.5 MB]
Get:5[http://repo.mongodb.org/apt/ubuntu/9trusty/mongodb-org/3.4/multiversesmongodb-org amd64 3.4.14 [3516 B]
Fetchedo67.1gMB-ing6s5(10.33MB/s) 100%]                            10.6 MB/s 0s
dpkg-preconfigure: unable to re-open stdin: No such file or directory
Selecting previously unselected package mongodb-org-shell.
(Reading database ... 67348 files and directories currently installed.)
Preparing to unpack .../mongodb-org-shell_3.4.14_amd64.deb ...
Unpacking mongodb-org-shell (3.4.14) ...
Selecting previously unselected package mongodb-org-server.
Preparing to unpack .../mongodb-org-server_3.4.14_amd64.deb ...
Unpacking mongodb-org-server (3.4.14) ...
Selecting previously unselected package mongodb-org-mongos.
Preparing to unpack .../mongodb-org-mongos_3.4.14_amd64.deb ...
Unpacking mongodb-org-mongos (3.4.14) ...
Selecting previously unselected package mongodb-org-tools.
Preparing to unpack .../mongodb-org-tools_3.4.14_amd64.deb ...
Unpacking mongodb-org-tools (3.4.14) ...
Selecting previously unselected package mongodb-org.
Preparing to unpack .../mongodb-org_3.4.14_amd64.deb ...
Unpacking mongodb-org (3.4.14) ...
Processing triggers for man-db (2.6.7.1-1ubuntu1) ...
Processing triggers for ureadahead (0.100.0-16) ...
Setting up mongodb-org-shell (3.4.14) ...
Setting up mongodb-org-server (3.4.14) ...
Adding system user `mongodb' (UID 105) ...
Adding new user `mongodb' (UID 105) with group `nogroup' ...
Not creating home directory `/home/mongodb'.
Adding group `mongodb' (GID 112) ...
Done.
Adding user `mongodb' to group `mongodb' ...
Adding user mongodb to group mongodb
Done.
invoke-rc.d: unknown initscript, /etc/init.d/mongod not found.
invoke-rc.d: policy-rc.d denied execution of start.
Setting up mongodb-org-mongos (3.4.14) ...
Setting up mongodb-org-tools (3.4.14) ...
Processing triggers for ureadahead (0.100.0-16) ...
Setting up mongodb-org (3.4.14) ...
W: Duplicate sources.list entry http://ppa.launchpad.net/git-core/ppa/ubuntu/ trusty/main amd64 Packages (/var/lib/apt/lists/ppa.launchpad.net_git-core_ppa_ubuntu_dists_trusty_main_binary-amd64_Packages.gz)
W: You may want to run apt-get update to correct these problems
+ sudo -i gem install pdd
Fetching: slop-4.6.1.gem (100%)
Successfully installed slop-4.6.1
Fetching: rainbow-3.0.0.gem (100%)
Successfully installed rainbow-3.0.0
Fetching: mini_portile2-2.3.0.gem (100%)
Successfully installed mini_portile2-2.3.0
Fetching: nokogiri-1.8.2.gem (100%)
Building native extensions.  This could take a while...
Successfully installed nokogiri-1.8.2
Fetching: pdd-0.20.3.gem (100%)
Successfully installed pdd-0.20.3
Parsing documentation for slop-4.6.1
Installing ri documentation for slop-4.6.1
Parsing documentation for rainbow-3.0.0
Installing ri documentation for rainbow-3.0.0
Parsing documentation for mini_portile2-2.3.0
Installing ri documentation for mini_portile2-2.3.0
Parsing documentation for nokogiri-1.8.2
Installing ri documentation for nokogiri-1.8.2
Parsing documentation for pdd-0.20.3
Installing ri documentation for pdd-0.20.3
Done installing documentation for slop, rainbow, mini_portile2, nokogiri, pdd after 15 seconds
5 gems installed
+ sudo -i gem install xcop
Fetching: differ-0.1.2.gem (100%)
Successfully installed differ-0.1.2
Fetching: xcop-0.5.8.gem (100%)
Successfully installed xcop-0.5.8
Parsing documentation for differ-0.1.2
Installing ri documentation for differ-0.1.2
Parsing documentation for xcop-0.5.8
Installing ri documentation for xcop-0.5.8
Done installing documentation for differ, xcop after 0 seconds
2 gems installed
+ sudo -i gem install sass -v 3.4.25
Fetching: sass-3.4.25.gem (100%)
Successfully installed sass-3.4.25
Parsing documentation for sass-3.4.25
Installing ri documentation for sass-3.4.25
Done installing documentation for sass after 5 seconds
1 gem installed
+ java -version
java version "1.8.0_121"
Java(TM) SE Runtime Environment (build 1.8.0_121-b13)
Java HotSpot(TM) 64-Bit Server VM (build 25.121-b13, mixed mode)
+ [[ 0.21.2 =~ ^[0-9]+(\.[0-9]+)*$ ]]
+ mvn clean process-resources --quiet
Java HotSpot(TM) 64-Bit Server VM warning: ignoring option MaxPermSize=256m; support was removed in 8.0
+ mvn clean versions:set -DnewVersion=0.21.2 --quiet
Java HotSpot(TM) 64-Bit Server VM warning: ignoring option MaxPermSize=256m; support was removed in 8.0
Props: {project.groupId=com.zerocracy, project.parent.version=0.49.2, project.parent.artifactId=parent, project.artifactId=farm, project.version=0.21.2, project.parent.groupId=com.jcabi}
+ git commit -am 0.21.2
[__rultor 1ce8d8d1] 0.21.2
 1 file changed, 1 insertion(+), 1 deletion(-)
+ cp ../settings.xml settings.xml
+ mvn clean package -Pqulice -Pzc-farm --errors --batch-mode --quiet
Java HotSpot(TM) 64-Bit Server VM warning: ignoring option MaxPermSize=256m; support was removed in 8.0

-------------------------------------------------------
 T E S T S
-------------------------------------------------------
Running com.zerocracy.pm.time.MilestonesTest
Tests run: 1, Failures: 0, Errors: 0, Skipped: 0, Time elapsed: 1.923 sec - in com.zerocracy.pm.time.MilestonesTest
Running com.zerocracy.pmo.BotsTest
Tests run: 1, Failures: 0, Errors: 0, Skipped: 0, Time elapsed: 1.734 sec - in com.zerocracy.pmo.BotsTest
Running com.zerocracy.pmo.AwardsTest
Tests run: 1, Failures: 0, Errors: 0, Skipped: 0, Time elapsed: 2.117 sec - in com.zerocracy.pmo.AwardsTest
Running com.zerocracy.pm.staff.votes.VsSpeedTest
Tests run: 2, Failures: 0, Errors: 0, Skipped: 0, Time elapsed: 0.434 sec - in com.zerocracy.pm.staff.votes.VsSpeedTest
Running com.zerocracy.XocumentTest
Tests run: 1, Failures: 0, Errors: 0, Skipped: 0, Time elapsed: 2.004 sec - in com.zerocracy.XocumentTest
Running com.zerocracy.tk.project.TkXmlTest
Tests run: 1, Failures: 0, Errors: 0, Skipped: 0, Time elapsed: 1.568 sec - in com.zerocracy.tk.project.TkXmlTest
Running com.zerocracy.cash.CashTest
Tests run: 15, Failures: 0, Errors: 0, Skipped: 0, Time elapsed: 0.764 sec - in com.zerocracy.cash.CashTest
Running com.zerocracy.radars.slack.ReProfileTest
Tests run: 2, Failures: 0, Errors: 0, Skipped: 0, Time elapsed: 1.877 sec - in com.zerocracy.radars.slack.ReProfileTest
Running com.zerocracy.pmo.DebtsTest
Tests run: 4, Failures: 0, Errors: 0, Skipped: 0, Time elapsed: 0.327 sec - in com.zerocracy.pmo.DebtsTest
Running com.zerocracy.pm.staff.ElectionsTest
Tests run: 7, Failures: 0, Errors: 0, Skipped: 0, Time elapsed: 6.406 sec - in com.zerocracy.pm.staff.ElectionsTest
Running com.zerocracy.farm.sync.SyncFarmTest
Thread 95/Thread-30 interrupted because of too long hold of "expectedfailure.xml" in PMO (over 1000 msec), f9daec76e4b9/1s/0/1/true/false by Thread-30: java.lang.IllegalStateException: Here!
        at com.zerocracy.farm.sync.Terminator.killer(Terminator.java:126)
        at com.zerocracy.farm.sync.Terminator.submit(Terminator.java:108)
        at com.zerocracy.farm.sync.SyncProject.acq(SyncProject.java:97)
        at com.zerocracy.pmo.Pmo.acq(Pmo.java:58)
        at com.zerocracy.farm.sync.SyncFarmTest.lambda$interruptsTooLongThread$1(SyncFarmTest.java:91)
        at org.cactoos.func.FuncOf.lambda$new$3(FuncOf.java:88)
        at org.cactoos.func.FuncOf.apply(FuncOf.java:104)
        at org.cactoos.func.UncheckedFunc.lambda$apply$0(UncheckedFunc.java:58)
        at org.cactoos.scalar.IoCheckedScalar.value(IoCheckedScalar.java:70)
        at org.cactoos.scalar.UncheckedScalar.value(UncheckedScalar.java:58)
        at org.cactoos.func.UncheckedFunc.apply(UncheckedFunc.java:59)
        at org.cactoos.func.RunnableOf.run(RunnableOf.java:89)
        at java.lang.Thread.run(Thread.java:745)

Exception in thread "Thread-30" java.io.UncheckedIOException: java.io.IOException: java.lang.InterruptedException: sleep interrupted    at org.cactoos.scalar.UncheckedScalar.value(UncheckedScalar.java:60)    at org.cactoos.func.UncheckedFunc.apply(UncheckedFunc.java:59)  at org.cactoos.func.RunnableOf.run(RunnableOf.java:89)  at java.lang.Thread.run(Thread.java:745)swallowed exception: java.lang.IllegalMonitorStateException
        at java.util.concurrent.locks.ReentrantLock$Sync.tryRelease(ReentrantLock.java:151)
        at java.util.concurrent.locks.AbstractQueuedSynchronizer.release(AbstractQueuedSynchronizer.java:1261)
        at java.util.concurrent.locks.ReentrantLock.unlock(ReentrantLock.java:457)
        at com.zerocracy.farm.SmartLock.unlock(SmartLock.java:131)
        at com.zerocracy.farm.sync.Terminator.lambda$killer$1(Terminator.java:140)
        at org.cactoos.func.FuncOf.lambda$new$3(FuncOf.java:88)
        at org.cactoos.func.FuncOf.apply(FuncOf.java:104)
        at org.cactoos.func.UncheckedFunc.lambda$apply$0(UncheckedFunc.java:58)
        at org.cactoos.scalar.IoCheckedScalar.value(IoCheckedScalar.java:70)
        at org.cactoos.scalar.UncheckedScalar.value(UncheckedScalar.java:58)
        at org.cactoos.func.UncheckedFunc.apply(UncheckedFunc.java:59)
        at org.cactoos.func.RunnableOf.run(RunnableOf.java:89)
        at com.jcabi.log.VerboseRunnable.run(VerboseRunnable.java:190)
        at java.util.concurrent.Executors$RunnableAdapter.call(Executors.java:511)
        at java.util.concurrent.FutureTask.run(FutureTask.java:266)
        at java.util.concurrent.ThreadPoolExecutor.runWorker(ThreadPoolExecutor.java:1142)
        at java.util.concurrent.ThreadPoolExecutor$Worker.run(ThreadPoolExecutor.java:617)
        at com.jcabi.log.VerboseThreads$Wrap.run(VerboseThreads.java:221)
        at java.lang.Thread.run(Thread.java:745)

Caused by: java.io.IOException: java.lang.InterruptedException: sleep interrupted       at org.cactoos.scalar.IoCheckedScalar.value(IoCheckedScalar.java:76)    at org.cactoos.scalar.UncheckedScalar.value(UncheckedScalar.java:58)    ... 3 moreCaused by: java.lang.InterruptedException: sleep interrupted  at java.lang.Thread.sleep(Native Method)        at java.lang.Thread.sleep(Thread.java:340)      at java.util.concurrent.TimeUnit.sleep(TimeUnit.java:386)       at com.zerocracy.farm.sync.SyncFarmTest.lambda$interruptsTooLongThread$1(SyncFarmTest.java:96)  at org.cactoos.func.FuncOf.lambda$new$3(FuncOf.java:88) at org.cactoos.func.FuncOf.apply(FuncOf.java:104)       at org.cactoos.func.UncheckedFunc.lambda$apply$0(UncheckedFunc.java:58) at org.cactoos.scalar.IoCheckedScalar.value(IoCheckedScalar.java:70)    ... 4 moreTests run: 2, Failures: 0, Errors: 0, Skipped: 0, Time elapsed: 1.018 sec - in com.zerocracy.farm.sync.SyncFarmTest
Running com.zerocracy.tk.project.TkFootprintTest
Tests run: 2, Failures: 0, Errors: 0, Skipped: 0, Time elapsed: 14.615 sec - in com.zerocracy.tk.project.TkFootprintTest
Running com.zerocracy.farm.footprint.FtFarmTest
Tests run: 1, Failures: 0, Errors: 0, Skipped: 0, Time elapsed: 1.669 sec - in com.zerocracy.farm.footprint.FtFarmTest
Running com.zerocracy.entry.ExtMongobeeTest
Tests run: 1, Failures: 0, Errors: 0, Skipped: 0, Time elapsed: 4.987 sec - in com.zerocracy.entry.ExtMongobeeTest
Running com.zerocracy.farm.sync.SyncProjectTest
Tests run: 1, Failures: 0, Errors: 0, Skipped: 0, Time elapsed: 0.003 sec - in com.zerocracy.farm.sync.SyncProjectTest
Running com.zerocracy.tk.project.reports.OrderChampionsTest
Tests run: 1, Failures: 0, Errors: 0, Skipped: 0, Time elapsed: 0.492 sec - in com.zerocracy.tk.project.reports.OrderChampionsTest
Running com.zerocracy.pm.staff.ranks.RnkGithubBugTest
Tests run: 1, Failures: 0, Errors: 0, Skipped: 0, Time elapsed: 0.103 sec - in com.zerocracy.pm.staff.ranks.RnkGithubBugTest
Running com.zerocracy.farm.StkSafeTest
*** Couldn't find a suitable DSN, Sentry operations will do nothing! See documentation: https://docs.sentry.io/clients/java/ ***
Tests run: 2, Failures: 0, Errors: 0, Skipped: 0, Time elapsed: 1.311 sec - in com.zerocracy.farm.StkSafeTest
Running com.zerocracy.farm.guts.GsProjectTest
Tests run: 1, Failures: 0, Errors: 0, Skipped: 0, Time elapsed: 0.046 sec - in com.zerocracy.farm.guts.GsProjectTest
Running com.zerocracy.farm.ruled.RdItemTest
swallowed exception: java.lang.IllegalStateException('http://datum.zerocracy.com/latest/rules/pm/no-lost-boosts.xsl says: The boost for job "gh:test/test#55" exists in boosts.xml, but the job is absent in the WBS among 0 jobs.')
Tests run: 5, Failures: 0, Errors: 0, Skipped: 0, Time elapsed: 3.392 sec - in com.zerocracy.farm.ruled.RdItemTest
Running com.zerocracy.farm.reactive.RvAliveTest
Tests run: 1, Failures: 0, Errors: 0, Skipped: 0, Time elapsed: 0.102 sec - in com.zerocracy.farm.reactive.RvAliveTest
Running com.zerocracy.farm.props.PropsFarmTest
Tests run: 2, Failures: 0, Errors: 0, Skipped: 0, Time elapsed: 0.004 sec - in com.zerocracy.farm.props.PropsFarmTest
Running com.zerocracy.pm.qa.ReviewsTest
Tests run: 3, Failures: 0, Errors: 0, Skipped: 0, Time elapsed: 0.146 sec - in com.zerocracy.pm.qa.ReviewsTest
Running com.zerocracy.radars.github.TkGithubTest
Tests run: 1, Failures: 0, Errors: 0, Skipped: 0, Time elapsed: 0.017 sec - in com.zerocracy.radars.github.TkGithubTest
Running com.zerocracy.cash.PairTest
Tests run: 10, Failures: 0, Errors: 0, Skipped: 0, Time elapsed: 0.009 sec - in com.zerocracy.cash.PairTest
Running com.zerocracy.farm.reactive.BrigadeTest
Tests run: 3, Failures: 0, Errors: 0, Skipped: 0, Time elapsed: 1.099 sec - in com.zerocracy.farm.reactive.BrigadeTest
Running com.zerocracy.farm.ruled.RdIndexTest
Tests run: 1, Failures: 0, Errors: 0, Skipped: 0, Time elapsed: 0.127 sec - in com.zerocracy.farm.ruled.RdIndexTest
Running com.zerocracy.entry.ExtMongoTest
Tests run: 3, Failures: 0, Errors: 0, Skipped: 1, Time elapsed: 0.743 sec - in com.zerocracy.entry.ExtMongoTest
Running com.zerocracy.pmo.PeopleTest
Tests run: 14, Failures: 0, Errors: 0, Skipped: 0, Time elapsed: 1.481 sec - in com.zerocracy.pmo.PeopleTest
Running com.zerocracy.pm.ClaimsTest
Tests run: 6, Failures: 0, Errors: 0, Skipped: 1, Time elapsed: 1.958 sec - in com.zerocracy.pm.ClaimsTest
Running com.zerocracy.pm.staff.RolesTest
Tests run: 2, Failures: 0, Errors: 0, Skipped: 0, Time elapsed: 0.261 sec - in com.zerocracy.pm.staff.RolesTest
Running com.zerocracy.farm.fake.FkFarmTest
Tests run: 7, Failures: 0, Errors: 0, Skipped: 0, Time elapsed: 0.004 sec - in com.zerocracy.farm.fake.FkFarmTest
Running com.zerocracy.pm.cost.RatesTest
Tests run: 1, Failures: 0, Errors: 0, Skipped: 0, Time elapsed: 0.25 sec - in com.zerocracy.pm.cost.RatesTest
Running com.zerocracy.farm.fake.FkItemTest
Tests run: 4, Failures: 0, Errors: 0, Skipped: 0, Time elapsed: 0.003 sec - in com.zerocracy.farm.fake.FkItemTest
Running com.zerocracy.tk.project.reports.OrdersGivenByWeekTest
Tests run: 2, Failures: 0, Errors: 0, Skipped: 0, Time elapsed: 0.754 sec - in com.zerocracy.tk.project.reports.OrdersGivenByWeekTest
Running com.zerocracy.tk.TkJoinTest
Tests run: 2, Failures: 0, Errors: 0, Skipped: 0, Time elapsed: 0.361 sec - in com.zerocracy.tk.TkJoinTest
Running com.zerocracy.farm.reactive.StkGroovyTest
Tests run: 4, Failures: 0, Errors: 0, Skipped: 0, Time elapsed: 0.12 sec - in com.zerocracy.farm.reactive.StkGroovyTest
Running com.zerocracy.farm.fake.FkProjectTest
Tests run: 4, Failures: 0, Errors: 0, Skipped: 0, Time elapsed: 0.002 sec - in com.zerocracy.farm.fake.FkProjectTest
Running com.zerocracy.radars.github.ReQuestionTest
Tests run: 1, Failures: 0, Errors: 0, Skipped: 0, Time elapsed: 1.337 sec - in com.zerocracy.radars.github.ReQuestionTest
Running com.zerocracy.pm.staff.votes.VsBannedTest
Tests run: 2, Failures: 0, Errors: 0, Skipped: 0, Time elapsed: 0.046 sec - in com.zerocracy.pm.staff.votes.VsBannedTest
Running com.zerocracy.tk.project.reports.AwardChampionsTest
Tests run: 1, Failures: 0, Errors: 0, Skipped: 0, Time elapsed: 0.127 sec - in com.zerocracy.tk.project.reports.AwardChampionsTest
Running com.zerocracy.pm.FootprintTest
Tests run: 2, Failures: 0, Errors: 0, Skipped: 0, Time elapsed: 1.554 sec - in com.zerocracy.pm.FootprintTest
Running com.zerocracy.pm.cost.EquityTest
Tests run: 3, Failures: 0, Errors: 0, Skipped: 1, Time elapsed: 0.59 sec - in com.zerocracy.pm.cost.EquityTest
Running com.zerocracy.radars.QuestionTest
Tests run: 5, Failures: 0, Errors: 0, Skipped: 0, Time elapsed: 0.532 sec - in com.zerocracy.radars.QuestionTest
Running com.zerocracy.tk.profile.TkAgendaTest
Tests run: 2, Failures: 0, Errors: 0, Skipped: 0, Time elapsed: 0.643 sec - in com.zerocracy.tk.profile.TkAgendaTest
Running com.zerocracy.pm.in.ImpedimentsTest
Tests run: 1, Failures: 0, Errors: 0, Skipped: 0, Time elapsed: 0.334 sec - in com.zerocracy.pm.in.ImpedimentsTest
Running com.zerocracy.farm.S3FarmTest
Tests run: 4, Failures: 0, Errors: 0, Skipped: 0, Time elapsed: 0.888 sec - in com.zerocracy.farm.S3FarmTest
Running com.zerocracy.pm.scope.WbsTest
Tests run: 2, Failures: 0, Errors: 0, Skipped: 0, Time elapsed: 0.077 sec - in com.zerocracy.pm.scope.WbsTest
Running com.zerocracy.pm.staff.BansTest
Tests run: 2, Failures: 0, Errors: 0, Skipped: 0, Time elapsed: 0.206 sec - in com.zerocracy.pm.staff.BansTest
Running com.zerocracy.radars.github.ReIfAddressedTest
Tests run: 3, Failures: 0, Errors: 0, Skipped: 0, Time elapsed: 0.074 sec - in com.zerocracy.radars.github.ReIfAddressedTest
Running com.zerocracy.tk.RqUserTest
Tests run: 1, Failures: 0, Errors: 0, Skipped: 0, Time elapsed: 0.268 sec - in com.zerocracy.tk.RqUserTest
Running com.zerocracy.tk.profile.TkAwardsTest
Tests run: 1, Failures: 0, Errors: 0, Skipped: 0, Time elapsed: 0.516 sec - in com.zerocracy.tk.profile.TkAwardsTest
Running com.zerocracy.pm.staff.ranks.RnkBoostTest
Tests run: 1, Failures: 0, Errors: 0, Skipped: 0, Time elapsed: 0.463 sec - in com.zerocracy.pm.staff.ranks.RnkBoostTest
Running com.zerocracy.pm.cost.BoostsTest
Tests run: 3, Failures: 0, Errors: 0, Skipped: 0, Time elapsed: 0.164 sec - in com.zerocracy.pm.cost.BoostsTest
Running com.zerocracy.radars.github.RbOnUnassignTest
Tests run: 1, Failures: 0, Errors: 0, Skipped: 0, Time elapsed: 0.056 sec - in com.zerocracy.radars.github.RbOnUnassignTest
Running com.zerocracy.farm.reactive.StkSmartTest
Tests run: 3, Failures: 0, Errors: 0, Skipped: 0, Time elapsed: 0.003 sec - in com.zerocracy.farm.reactive.StkSmartTest
Running com.zerocracy.pmo.RfpsTest
Tests run: 3, Failures: 0, Errors: 0, Skipped: 0, Time elapsed: 0.521 sec - in com.zerocracy.pmo.RfpsTest
Running com.zerocracy.radars.github.RbByLabelTest
Tests run: 2, Failures: 0, Errors: 0, Skipped: 0, Time elapsed: 0.053 sec - in com.zerocracy.radars.github.RbByLabelTest
Running com.zerocracy.XsdResolverTest
Tests run: 6, Failures: 0, Errors: 0, Skipped: 0, Time elapsed: 0.754 sec - in com.zerocracy.XsdResolverTest
Running com.zerocracy.pm.staff.votes.VsVacationTest
Tests run: 1, Failures: 0, Errors: 0, Skipped: 0, Time elapsed: 0.038 sec - in com.zerocracy.pm.staff.votes.VsVacationTest
Running com.zerocracy.farm.SmartLockTest
Tests run: 4, Failures: 0, Errors: 0, Skipped: 0, Time elapsed: 0.05 sec - in com.zerocracy.farm.SmartLockTest
Running com.zerocracy.pm.ClaimInTest
Tests run: 3, Failures: 0, Errors: 0, Skipped: 0, Time elapsed: 0.014 sec - in com.zerocracy.pm.ClaimInTest
Running com.zerocracy.tk.profile.TkProfileTest
Tests run: 1, Failures: 0, Errors: 0, Skipped: 0, Time elapsed: 1.53 sec - in com.zerocracy.tk.profile.TkProfileTest
Running com.zerocracy.tk.project.TkArtifactTest
Tests run: 2, Failures: 0, Errors: 0, Skipped: 0, Time elapsed: 1.219 sec - in com.zerocracy.tk.project.TkArtifactTest
Running com.zerocracy.tk.CcSecureTest
Tests run: 1, Failures: 0, Errors: 0, Skipped: 0, Time elapsed: 0.002 sec - in com.zerocracy.tk.CcSecureTest
Running com.zerocracy.pmo.ProjectsTest
Tests run: 1, Failures: 0, Errors: 0, Skipped: 0, Time elapsed: 0.072 sec - in com.zerocracy.pmo.ProjectsTest
Running com.zerocracy.PolicyTest
Tests run: 1, Failures: 0, Errors: 0, Skipped: 0, Time elapsed: 0.002 sec - in com.zerocracy.PolicyTest
Running com.zerocracy.cash.CurrencyTest
Tests run: 2, Failures: 0, Errors: 0, Skipped: 0, Time elapsed: 0.001 sec - in com.zerocracy.cash.CurrencyTest
Running com.zerocracy.tk.project.TkClaimTest
Tests run: 1, Failures: 0, Errors: 0, Skipped: 0, Time elapsed: 1.788 sec - in com.zerocracy.tk.project.TkClaimTest
Running com.zerocracy.pm.staff.votes.VsRandomTest
Tests run: 1, Failures: 0, Errors: 0, Skipped: 0, Time elapsed: 0.445 sec - in com.zerocracy.pm.staff.votes.VsRandomTest
Running com.zerocracy.pmo.CatalogTest
Tests run: 7, Failures: 0, Errors: 0, Skipped: 0, Time elapsed: 0.242 sec - in com.zerocracy.pmo.CatalogTest
Running com.zerocracy.farm.S3ItemTest
Tests run: 5, Failures: 0, Errors: 0, Skipped: 1, Time elapsed: 0.135 sec - in com.zerocracy.farm.S3ItemTest
Running com.zerocracy.ParTest
Tests run: 5, Failures: 0, Errors: 0, Skipped: 0, Time elapsed: 0.006 sec - in com.zerocracy.ParTest
Running com.zerocracy.pm.staff.votes.VsLosersTest
Tests run: 1, Failures: 0, Errors: 0, Skipped: 0, Time elapsed: 0.004 sec - in com.zerocracy.pm.staff.votes.VsLosersTest
Running com.zerocracy.farm.ruled.RdFarmTest
Tests run: 2, Failures: 0, Errors: 0, Skipped: 0, Time elapsed: 5.8 sec - in com.zerocracy.farm.ruled.RdFarmTest
Running com.zerocracy.pm.staff.ranks.RnkRevTest
Tests run: 1, Failures: 0, Errors: 0, Skipped: 0, Time elapsed: 0.095 sec - in com.zerocracy.pm.staff.ranks.RnkRevTest
Running com.zerocracy.pm.cost.LedgerTest
Tests run: 3, Failures: 0, Errors: 0, Skipped: 0, Time elapsed: 0.604 sec - in com.zerocracy.pm.cost.LedgerTest
Running com.zerocracy.TxnTest
Tests run: 2, Failures: 0, Errors: 0, Skipped: 0, Time elapsed: 0.003 sec - in com.zerocracy.TxnTest
Running com.zerocracy.entry.ExtGithubTest
Tests run: 1, Failures: 0, Errors: 0, Skipped: 0, Time elapsed: 0.004 sec - in com.zerocracy.entry.ExtGithubTest
Running com.zerocracy.pm.in.OrdersTest
Tests run: 2, Failures: 0, Errors: 0, Skipped: 0, Time elapsed: 1.024 sec - in com.zerocracy.pm.in.OrdersTest
Running com.zerocracy.farm.S3ProjectTest
Tests run: 2, Failures: 0, Errors: 0, Skipped: 0, Time elapsed: 0.115 sec - in com.zerocracy.farm.S3ProjectTest
Running com.zerocracy.tk.project.TkProjectTest
Tests run: 1, Failures: 0, Errors: 0, Skipped: 0, Time elapsed: 1.045 sec - in com.zerocracy.tk.project.TkProjectTest
Running com.zerocracy.pmo.SpeedTest
Tests run: 3, Failures: 0, Errors: 0, Skipped: 0, Time elapsed: 0.227 sec - in com.zerocracy.pmo.SpeedTest
Running com.zerocracy.radars.github.RbOnCloseTest
Tests run: 2, Failures: 0, Errors: 0, Skipped: 0, Time elapsed: 0.455 sec - in com.zerocracy.radars.github.RbOnCloseTest
Running com.zerocracy.pmo.AgendaTest
Tests run: 4, Failures: 0, Errors: 0, Skipped: 0, Time elapsed: 0.206 sec - in com.zerocracy.pmo.AgendaTest
Running com.zerocracy.pm.cost.VestingTest
Tests run: 1, Failures: 0, Errors: 0, Skipped: 0, Time elapsed: 0.003 sec - in com.zerocracy.pm.cost.VestingTest
Running com.zerocracy.tk.TkPulseTest
Tests run: 1, Failures: 0, Errors: 0, Skipped: 0, Time elapsed: 0.437 sec - in com.zerocracy.tk.TkPulseTest
Running com.zerocracy.pm.staff.votes.VsNoRoomTest
Tests run: 1, Failures: 0, Errors: 0, Skipped: 0, Time elapsed: 0.479 sec - in com.zerocracy.pm.staff.votes.VsNoRoomTest
Running com.zerocracy.pmo.HintTest
Tests run: 1, Failures: 0, Errors: 0, Skipped: 0, Time elapsed: 2.644 sec - in com.zerocracy.pmo.HintTest
Running com.zerocracy.tk.project.TkReportTest
Tests run: 1, Failures: 0, Errors: 0, Skipped: 0, Time elapsed: 0.945 sec - in com.zerocracy.tk.project.TkReportTest
Running com.zerocracy.tk.TkShutdownTest
Tests run: 1, Failures: 0, Errors: 0, Skipped: 0, Time elapsed: 0.011 sec - in com.zerocracy.tk.TkShutdownTest
Running com.zerocracy.farm.reactive.RvProjectTest
Tests run: 2, Failures: 0, Errors: 0, Skipped: 0, Time elapsed: 11.997 sec - in com.zerocracy.farm.reactive.RvProjectTest
Running com.zerocracy.farm.guts.TkGutsTest
Tests run: 1, Failures: 0, Errors: 0, Skipped: 0, Time elapsed: 1.232 sec - in com.zerocracy.farm.guts.TkGutsTest
Running com.zerocracy.pm.cost.EstimatesTest
Tests run: 2, Failures: 0, Errors: 0, Skipped: 0, Time elapsed: 0.665 sec - in com.zerocracy.pm.cost.EstimatesTest
Running [modifies_vacation_mode on]
Tests run: 3, Failures: 0, Errors: 0, Skipped: 0, Time elapsed: 3.572 sec - in [modifies_vacation_mode on]
Running [com/zerocracy/bundles/zerocrat_assignment_adds_to_wbs]
swallowed runtime exception: java.lang.IllegalStateException: java.lang.IllegalStateException: java.lang.reflect.InvocationTargetException in com/zerocracy/stk/pm/scope/wbs/add_job_to_wbs.groovy
        at com.zerocracy.farm.StkSafe.process(StkSafe.java:115)
        at com.zerocracy.farm.reactive.StkSmart.process(StkSmart.java:66)
        at com.zerocracy.farm.reactive.Brigade.process(Brigade.java:82)
        at com.zerocracy.farm.reactive.Brigade.lambda$apply$0(Brigade.java:64)
        at org.cactoos.func.UncheckedFunc.lambda$apply$0(UncheckedFunc.java:58)
        at org.cactoos.scalar.IoCheckedScalar.value(IoCheckedScalar.java:70)
        at org.cactoos.scalar.UncheckedScalar.value(UncheckedScalar.java:58)
        at org.cactoos.func.UncheckedFunc.apply(UncheckedFunc.java:59)
        at org.cactoos.iterator.Filtered.hasNext(Filtered.java:90)
        at org.cactoos.iterator.LengthOf.lambda$new$0(LengthOf.java:52)
        at org.cactoos.scalar.IoCheckedScalar.value(IoCheckedScalar.java:70)
        at org.cactoos.scalar.UncheckedScalar.value(UncheckedScalar.java:58)
        at org.cactoos.scalar.NumberEnvelope.doubleValue(NumberEnvelope.java:113)
        at org.cactoos.iterable.LengthOf.lambda$new$0(LengthOf.java:51)
        at org.cactoos.scalar.NumberEnvelope.lambda$new$1(NumberEnvelope.java:73)
        at org.cactoos.scalar.IoCheckedScalar.value(IoCheckedScalar.java:70)
        at org.cactoos.scalar.UncheckedScalar.value(UncheckedScalar.java:58)
        at org.cactoos.scalar.NumberEnvelope.intValue(NumberEnvelope.java:98)
        at com.zerocracy.farm.reactive.Brigade.apply(Brigade.java:67)
        at com.zerocracy.farm.reactive.Brigade.apply(Brigade.java:37)
        at org.cactoos.func.IoCheckedBiFunc.lambda$apply$0(IoCheckedBiFunc.java:60)
        at org.cactoos.scalar.IoCheckedScalar.value(IoCheckedScalar.java:70)
        at org.cactoos.func.IoCheckedBiFunc.apply(IoCheckedBiFunc.java:61)
        at com.zerocracy.farm.reactive.DefaultFlush.process(DefaultFlush.java:97)
        at com.zerocracy.farm.reactive.DefaultFlush.exec(DefaultFlush.java:70)
        at com.zerocracy.farm.reactive.DefaultFlush.exec(DefaultFlush.java:44)
        at com.zerocracy.farm.reactive.AsyncFlush.lambda$exec$2(AsyncFlush.java:118)
        at com.jcabi.log.VerboseCallable.call(VerboseCallable.java:173)
        at java.util.concurrent.FutureTask.run(FutureTask.java:266)
        at java.util.concurrent.ThreadPoolExecutor.runWorker(ThreadPoolExecutor.java:1142)
        at java.util.concurrent.ThreadPoolExecutor$Worker.run(ThreadPoolExecutor.java:617)
        at com.jcabi.log.VerboseThreads$Wrap.run(VerboseThreads.java:221)
        at java.lang.Thread.run(Thread.java:745)
Caused by: java.lang.IllegalStateException: java.lang.reflect.InvocationTargetException in com/zerocracy/stk/pm/scope/wbs/add_job_to_wbs.groovy
        at com.zerocracy.farm.reactive.StkGroovy.process(StkGroovy.java:125)
        at com.zerocracy.farm.StkSafe.process(StkSafe.java:81)
        ... 32 more
Caused by: java.lang.reflect.InvocationTargetException
        at sun.reflect.GeneratedMethodAccessor64.invoke(Unknown Source)
        at sun.reflect.DelegatingMethodAccessorImpl.invoke(DelegatingMethodAccessorImpl.java:43)
        at java.lang.reflect.Method.invoke(Method.java:498)
        at com.zerocracy.farm.reactive.StkGroovy.process(StkGroovy.java:115)
        ... 33 more
Caused by: java.lang.NullPointerException
        at org.glassfish.json.JsonObjectBuilderImpl$JsonObjectImpl.getInt(JsonObjectBuilderImpl.java:271)
        at javax.json.JsonObject$getInt.call(Unknown Source)
        at org.codehaus.groovy.runtime.callsite.CallSiteArray.defaultCall(CallSiteArray.java:45)
        at org.codehaus.groovy.runtime.callsite.AbstractCallSite.call(AbstractCallSite.java:108)
        at org.codehaus.groovy.runtime.callsite.AbstractCallSite.call(AbstractCallSite.java:116)
        at com.zerocracy.stk.pm.scope.wbs.add_job_to_wbs.exec(add_job_to_wbs.groovy:57)
        ... 37 more

swallowed runtime exception: java.lang.IllegalStateException: java.lang.IllegalStateException: java.lang.reflect.InvocationTargetException in com/zerocracy/stk/pmo/awards/update_reputation.groovy
        at com.zerocracy.farm.StkSafe.process(StkSafe.java:115)
        at com.zerocracy.farm.reactive.StkSmart.process(StkSmart.java:66)
        at com.zerocracy.farm.reactive.Brigade.process(Brigade.java:82)
        at com.zerocracy.farm.reactive.Brigade.lambda$apply$0(Brigade.java:64)
        at org.cactoos.func.UncheckedFunc.lambda$apply$0(UncheckedFunc.java:58)
        at org.cactoos.scalar.IoCheckedScalar.value(IoCheckedScalar.java:70)
        at org.cactoos.scalar.UncheckedScalar.value(UncheckedScalar.java:58)
        at org.cactoos.func.UncheckedFunc.apply(UncheckedFunc.java:59)
        at org.cactoos.iterator.Filtered.hasNext(Filtered.java:90)
        at org.cactoos.iterator.LengthOf.lambda$new$0(LengthOf.java:52)
        at org.cactoos.scalar.IoCheckedScalar.value(IoCheckedScalar.java:70)
        at org.cactoos.scalar.UncheckedScalar.value(UncheckedScalar.java:58)
        at org.cactoos.scalar.NumberEnvelope.doubleValue(NumberEnvelope.java:113)
        at org.cactoos.iterable.LengthOf.lambda$new$0(LengthOf.java:51)
        at org.cactoos.scalar.NumberEnvelope.lambda$new$1(NumberEnvelope.java:73)
        at org.cactoos.scalar.IoCheckedScalar.value(IoCheckedScalar.java:70)
        at org.cactoos.scalar.UncheckedScalar.value(UncheckedScalar.java:58)
        at org.cactoos.scalar.NumberEnvelope.intValue(NumberEnvelope.java:98)
        at com.zerocracy.farm.reactive.Brigade.apply(Brigade.java:67)
        at com.zerocracy.farm.reactive.Brigade.apply(Brigade.java:37)
        at org.cactoos.func.IoCheckedBiFunc.lambda$apply$0(IoCheckedBiFunc.java:60)
        at org.cactoos.scalar.IoCheckedScalar.value(IoCheckedScalar.java:70)
        at org.cactoos.func.IoCheckedBiFunc.apply(IoCheckedBiFunc.java:61)
        at com.zerocracy.farm.reactive.DefaultFlush.process(DefaultFlush.java:97)
        at com.zerocracy.farm.reactive.DefaultFlush.exec(DefaultFlush.java:70)
        at com.zerocracy.farm.reactive.DefaultFlush.exec(DefaultFlush.java:44)
        at com.zerocracy.farm.reactive.AsyncFlush.lambda$exec$2(AsyncFlush.java:118)
        at com.jcabi.log.VerboseCallable.call(VerboseCallable.java:173)
        at java.util.concurrent.FutureTask.run(FutureTask.java:266)
        at java.util.concurrent.ThreadPoolExecutor.runWorker(ThreadPoolExecutor.java:1142)
        at java.util.concurrent.ThreadPoolExecutor$Worker.run(ThreadPoolExecutor.java:617)
        at com.jcabi.log.VerboseThreads$Wrap.run(VerboseThreads.java:221)
        at java.lang.Thread.run(Thread.java:745)
Caused by: java.lang.IllegalStateException: java.lang.reflect.InvocationTargetException in com/zerocracy/stk/pmo/awards/update_reputation.groovy
        at com.zerocracy.farm.reactive.StkGroovy.process(StkGroovy.java:125)
        at com.zerocracy.farm.StkSafe.process(StkSafe.java:81)
        ... 32 more
Caused by: java.lang.reflect.InvocationTargetException
        at sun.reflect.GeneratedMethodAccessor108.invoke(Unknown Source)
        at sun.reflect.DelegatingMethodAccessorImpl.invoke(DelegatingMethodAccessorImpl.java:43)
        at java.lang.reflect.Method.invoke(Method.java:498)
        at com.zerocracy.farm.reactive.StkGroovy.process(StkGroovy.java:115)
        ... 33 more
Caused by: java.lang.IllegalArgumentException: Person @yegor256[/z](https://www.0crat.com/u/yegor256) doesn't exist
        at com.zerocracy.pmo.People.reputation(People.java:656)
        at com.zerocracy.pmo.People$reputation$7.call(Unknown Source)
        at com.zerocracy.stk.pmo.awards.update_reputation.exec(update_reputation.groovy:34)
        ... 37 more

swallowed runtime exception: java.lang.IllegalStateException: java.lang.IllegalStateException: java.lang.reflect.InvocationTargetException in com/zerocracy/stk/pmo/awards/update_reputation.groovy
        at com.zerocracy.farm.StkSafe.process(StkSafe.java:115)
        at com.zerocracy.farm.reactive.StkSmart.process(StkSmart.java:66)
        at com.zerocracy.farm.reactive.Brigade.process(Brigade.java:82)
        at com.zerocracy.farm.reactive.Brigade.lambda$apply$0(Brigade.java:64)
        at org.cactoos.func.UncheckedFunc.lambda$apply$0(UncheckedFunc.java:58)
        at org.cactoos.scalar.IoCheckedScalar.value(IoCheckedScalar.java:70)
        at org.cactoos.scalar.UncheckedScalar.value(UncheckedScalar.java:58)
        at org.cactoos.func.UncheckedFunc.apply(UncheckedFunc.java:59)
        at org.cactoos.iterator.Filtered.hasNext(Filtered.java:90)
        at org.cactoos.iterator.LengthOf.lambda$new$0(LengthOf.java:52)
        at org.cactoos.scalar.IoCheckedScalar.value(IoCheckedScalar.java:70)
        at org.cactoos.scalar.UncheckedScalar.value(UncheckedScalar.java:58)
        at org.cactoos.scalar.NumberEnvelope.doubleValue(NumberEnvelope.java:113)
        at org.cactoos.iterable.LengthOf.lambda$new$0(LengthOf.java:51)
        at org.cactoos.scalar.NumberEnvelope.lambda$new$1(NumberEnvelope.java:73)
        at org.cactoos.scalar.IoCheckedScalar.value(IoCheckedScalar.java:70)
        at org.cactoos.scalar.UncheckedScalar.value(UncheckedScalar.java:58)
        at org.cactoos.scalar.NumberEnvelope.intValue(NumberEnvelope.java:98)
        at com.zerocracy.farm.reactive.Brigade.apply(Brigade.java:67)
        at com.zerocracy.farm.reactive.Brigade.apply(Brigade.java:37)
        at org.cactoos.func.IoCheckedBiFunc.lambda$apply$0(IoCheckedBiFunc.java:60)
        at org.cactoos.scalar.IoCheckedScalar.value(IoCheckedScalar.java:70)
        at org.cactoos.func.IoCheckedBiFunc.apply(IoCheckedBiFunc.java:61)
        at com.zerocracy.farm.reactive.DefaultFlush.process(DefaultFlush.java:97)
        at com.zerocracy.farm.reactive.DefaultFlush.exec(DefaultFlush.java:70)
        at com.zerocracy.farm.reactive.DefaultFlush.exec(DefaultFlush.java:44)
        at com.zerocracy.farm.reactive.AsyncFlush.lambda$exec$2(AsyncFlush.java:118)
        at com.jcabi.log.VerboseCallable.call(VerboseCallable.java:173)
        at java.util.concurrent.FutureTask.run(FutureTask.java:266)
        at java.util.concurrent.ThreadPoolExecutor.runWorker(ThreadPoolExecutor.java:1142)
        at java.util.concurrent.ThreadPoolExecutor$Worker.run(ThreadPoolExecutor.java:617)
        at com.jcabi.log.VerboseThreads$Wrap.run(VerboseThreads.java:221)
        at java.lang.Thread.run(Thread.java:745)
Caused by: java.lang.IllegalStateException: java.lang.reflect.InvocationTargetException in com/zerocracy/stk/pmo/awards/update_reputation.groovy
        at com.zerocracy.farm.reactive.StkGroovy.process(StkGroovy.java:125)
        at com.zerocracy.farm.StkSafe.process(StkSafe.java:81)
        ... 32 more
Caused by: java.lang.reflect.InvocationTargetException
        at sun.reflect.GeneratedMethodAccessor108.invoke(Unknown Source)
        at sun.reflect.DelegatingMethodAccessorImpl.invoke(DelegatingMethodAccessorImpl.java:43)
        at java.lang.reflect.Method.invoke(Method.java:498)
        at com.zerocracy.farm.reactive.StkGroovy.process(StkGroovy.java:115)
        ... 33 more
Caused by: java.lang.IllegalArgumentException: Person @yegor256[/z](https://www.0crat.com/u/yegor256) doesn't exist
        at com.zerocracy.pmo.People.reputation(People.java:656)
        at com.zerocracy.pmo.People$reputation$7.call(Unknown Source)
        at com.zerocracy.stk.pmo.awards.update_reputation.exec(update_reputation.groovy:34)
        ... 37 more

swallowed runtime exception: java.lang.IllegalStateException: java.lang.IllegalStateException: java.lang.reflect.InvocationTargetException in com/zerocracy/stk/pmo/awards/update_reputation.groovy
        at com.zerocracy.farm.StkSafe.process(StkSafe.java:115)
        at com.zerocracy.farm.reactive.StkSmart.process(StkSmart.java:66)
        at com.zerocracy.farm.reactive.Brigade.process(Brigade.java:82)
        at com.zerocracy.farm.reactive.Brigade.lambda$apply$0(Brigade.java:64)
        at org.cactoos.func.UncheckedFunc.lambda$apply$0(UncheckedFunc.java:58)
        at org.cactoos.scalar.IoCheckedScalar.value(IoCheckedScalar.java:70)
        at org.cactoos.scalar.UncheckedScalar.value(UncheckedScalar.java:58)
        at org.cactoos.func.UncheckedFunc.apply(UncheckedFunc.java:59)
        at org.cactoos.iterator.Filtered.hasNext(Filtered.java:90)
        at org.cactoos.iterator.LengthOf.lambda$new$0(LengthOf.java:52)
        at org.cactoos.scalar.IoCheckedScalar.value(IoCheckedScalar.java:70)
        at org.cactoos.scalar.UncheckedScalar.value(UncheckedScalar.java:58)
        at org.cactoos.scalar.NumberEnvelope.doubleValue(NumberEnvelope.java:113)
        at org.cactoos.iterable.LengthOf.lambda$new$0(LengthOf.java:51)
        at org.cactoos.scalar.NumberEnvelope.lambda$new$1(NumberEnvelope.java:73)
        at org.cactoos.scalar.IoCheckedScalar.value(IoCheckedScalar.java:70)
        at org.cactoos.scalar.UncheckedScalar.value(UncheckedScalar.java:58)
        at org.cactoos.scalar.NumberEnvelope.intValue(NumberEnvelope.java:98)
        at com.zerocracy.farm.reactive.Brigade.apply(Brigade.java:67)
        at com.zerocracy.farm.reactive.Brigade.apply(Brigade.java:37)
        at org.cactoos.func.IoCheckedBiFunc.lambda$apply$0(IoCheckedBiFunc.java:60)
        at org.cactoos.scalar.IoCheckedScalar.value(IoCheckedScalar.java:70)
        at org.cactoos.func.IoCheckedBiFunc.apply(IoCheckedBiFunc.java:61)
        at com.zerocracy.farm.reactive.DefaultFlush.process(DefaultFlush.java:97)
        at com.zerocracy.farm.reactive.DefaultFlush.exec(DefaultFlush.java:70)
        at com.zerocracy.farm.reactive.DefaultFlush.exec(DefaultFlush.java:44)
        at com.zerocracy.farm.reactive.AsyncFlush.lambda$exec$2(AsyncFlush.java:118)
        at com.jcabi.log.VerboseCallable.call(VerboseCallable.java:173)
        at java.util.concurrent.FutureTask.run(FutureTask.java:266)
        at java.util.concurrent.ThreadPoolExecutor.runWorker(ThreadPoolExecutor.java:1142)
        at java.util.concurrent.ThreadPoolExecutor$Worker.run(ThreadPoolExecutor.java:617)
        at com.jcabi.log.VerboseThreads$Wrap.run(VerboseThreads.java:221)
        at java.lang.Thread.run(Thread.java:745)
Caused by: java.lang.IllegalStateException: java.lang.reflect.InvocationTargetException in com/zerocracy/stk/pmo/awards/update_reputation.groovy
        at com.zerocracy.farm.reactive.StkGroovy.process(StkGroovy.java:125)
        at com.zerocracy.farm.StkSafe.process(StkSafe.java:81)
        ... 32 more
Caused by: java.lang.reflect.InvocationTargetException
        at sun.reflect.GeneratedMethodAccessor108.invoke(Unknown Source)
        at sun.reflect.DelegatingMethodAccessorImpl.invoke(DelegatingMethodAccessorImpl.java:43)
        at java.lang.reflect.Method.invoke(Method.java:498)
        at com.zerocracy.farm.reactive.StkGroovy.process(StkGroovy.java:115)
        ... 33 more
Caused by: java.lang.IllegalArgumentException: Person @dmarkov[/z](https://www.0crat.com/u/dmarkov) doesn't exist
        at com.zerocracy.pmo.People.reputation(People.java:656)
        at com.zerocracy.pmo.People$reputation$7.call(Unknown Source)
        at com.zerocracy.stk.pmo.awards.update_reputation.exec(update_reputation.groovy:34)
        ... 37 more

swallowed runtime exception: java.lang.IllegalStateException: java.lang.IllegalStateException: java.lang.reflect.InvocationTargetException in com/zerocracy/stk/pmo/awards/update_reputation.groovy
        at com.zerocracy.farm.StkSafe.process(StkSafe.java:115)
        at com.zerocracy.farm.reactive.StkSmart.process(StkSmart.java:66)
        at com.zerocracy.farm.reactive.Brigade.process(Brigade.java:82)
        at com.zerocracy.farm.reactive.Brigade.lambda$apply$0(Brigade.java:64)
        at org.cactoos.func.UncheckedFunc.lambda$apply$0(UncheckedFunc.java:58)
        at org.cactoos.scalar.IoCheckedScalar.value(IoCheckedScalar.java:70)
        at org.cactoos.scalar.UncheckedScalar.value(UncheckedScalar.java:58)
        at org.cactoos.func.UncheckedFunc.apply(UncheckedFunc.java:59)
        at org.cactoos.iterator.Filtered.hasNext(Filtered.java:90)
        at org.cactoos.iterator.LengthOf.lambda$new$0(LengthOf.java:52)
        at org.cactoos.scalar.IoCheckedScalar.value(IoCheckedScalar.java:70)
        at org.cactoos.scalar.UncheckedScalar.value(UncheckedScalar.java:58)
        at org.cactoos.scalar.NumberEnvelope.doubleValue(NumberEnvelope.java:113)
        at org.cactoos.iterable.LengthOf.lambda$new$0(LengthOf.java:51)
        at org.cactoos.scalar.NumberEnvelope.lambda$new$1(NumberEnvelope.java:73)
        at org.cactoos.scalar.IoCheckedScalar.value(IoCheckedScalar.java:70)
        at org.cactoos.scalar.UncheckedScalar.value(UncheckedScalar.java:58)
        at org.cactoos.scalar.NumberEnvelope.intValue(NumberEnvelope.java:98)
        at com.zerocracy.farm.reactive.Brigade.apply(Brigade.java:67)
        at com.zerocracy.farm.reactive.Brigade.apply(Brigade.java:37)
        at org.cactoos.func.IoCheckedBiFunc.lambda$apply$0(IoCheckedBiFunc.java:60)
        at org.cactoos.scalar.IoCheckedScalar.value(IoCheckedScalar.java:70)
        at org.cactoos.func.IoCheckedBiFunc.apply(IoCheckedBiFunc.java:61)
        at com.zerocracy.farm.reactive.DefaultFlush.process(DefaultFlush.java:97)
        at com.zerocracy.farm.reactive.DefaultFlush.exec(DefaultFlush.java:70)
        at com.zerocracy.farm.reactive.DefaultFlush.exec(DefaultFlush.java:44)
        at com.zerocracy.farm.reactive.AsyncFlush.lambda$exec$2(AsyncFlush.java:118)
        at com.jcabi.log.VerboseCallable.call(VerboseCallable.java:173)
        at java.util.concurrent.FutureTask.run(FutureTask.java:266)
        at java.util.concurrent.ThreadPoolExecutor.runWorker(ThreadPoolExecutor.java:1142)
        at java.util.concurrent.ThreadPoolExecutor$Worker.run(ThreadPoolExecutor.java:617)
        at com.jcabi.log.VerboseThreads$Wrap.run(VerboseThreads.java:221)
        at java.lang.Thread.run(Thread.java:745)
Caused by: java.lang.IllegalStateException: java.lang.reflect.InvocationTargetException in com/zerocracy/stk/pmo/awards/update_reputation.groovy
        at com.zerocracy.farm.reactive.StkGroovy.process(StkGroovy.java:125)
        at com.zerocracy.farm.StkSafe.process(StkSafe.java:81)
        ... 32 more
Caused by: java.lang.reflect.InvocationTargetException
        at sun.reflect.GeneratedMethodAccessor108.invoke(Unknown Source)
        at sun.reflect.DelegatingMethodAccessorImpl.invoke(DelegatingMethodAccessorImpl.java:43)
        at java.lang.reflect.Method.invoke(Method.java:498)
        at com.zerocracy.farm.reactive.StkGroovy.process(StkGroovy.java:115)
        ... 33 more
Caused by: java.lang.IllegalArgumentException: Person @yegor256[/z](https://www.0crat.com/u/yegor256) doesn't exist
        at com.zerocracy.pmo.People.reputation(People.java:656)
        at com.zerocracy.pmo.People$reputation$7.call(Unknown Source)
        at org.codehaus.groovy.runtime.callsite.CallSiteArray.defaultCall(CallSiteArray.java:45)
        at org.codehaus.groovy.runtime.callsite.AbstractCallSite.call(AbstractCallSite.java:108)
        at org.codehaus.groovy.runtime.callsite.AbstractCallSite.call(AbstractCallSite.java:120)
        at com.zerocracy.stk.pmo.awards.update_reputation.exec(update_reputation.groovy:34)
        ... 37 more

swallowed runtime exception: java.lang.IllegalStateException: java.lang.IllegalStateException: java.lang.reflect.InvocationTargetException in com/zerocracy/stk/pm/comm/notify_in_github.groovy
        at com.zerocracy.farm.StkSafe.process(StkSafe.java:115)
        at com.zerocracy.farm.reactive.StkSmart.process(StkSmart.java:66)
        at com.zerocracy.farm.reactive.Brigade.process(Brigade.java:82)
        at com.zerocracy.farm.reactive.Brigade.lambda$apply$0(Brigade.java:64)
        at org.cactoos.func.UncheckedFunc.lambda$apply$0(UncheckedFunc.java:58)
        at org.cactoos.scalar.IoCheckedScalar.value(IoCheckedScalar.java:70)
        at org.cactoos.scalar.UncheckedScalar.value(UncheckedScalar.java:58)
        at org.cactoos.func.UncheckedFunc.apply(UncheckedFunc.java:59)
        at org.cactoos.iterator.Filtered.hasNext(Filtered.java:90)
        at org.cactoos.iterator.LengthOf.lambda$new$0(LengthOf.java:52)
        at org.cactoos.scalar.IoCheckedScalar.value(IoCheckedScalar.java:70)
        at org.cactoos.scalar.UncheckedScalar.value(UncheckedScalar.java:58)
        at org.cactoos.scalar.NumberEnvelope.doubleValue(NumberEnvelope.java:113)
        at org.cactoos.iterable.LengthOf.lambda$new$0(LengthOf.java:51)
        at org.cactoos.scalar.NumberEnvelope.lambda$new$1(NumberEnvelope.java:73)
        at org.cactoos.scalar.IoCheckedScalar.value(IoCheckedScalar.java:70)
        at org.cactoos.scalar.UncheckedScalar.value(UncheckedScalar.java:58)
        at org.cactoos.scalar.NumberEnvelope.intValue(NumberEnvelope.java:98)
        at com.zerocracy.farm.reactive.Brigade.apply(Brigade.java:67)
        at com.zerocracy.farm.reactive.Brigade.apply(Brigade.java:37)
        at org.cactoos.func.IoCheckedBiFunc.lambda$apply$0(IoCheckedBiFunc.java:60)
        at org.cactoos.scalar.IoCheckedScalar.value(IoCheckedScalar.java:70)
        at org.cactoos.func.IoCheckedBiFunc.apply(IoCheckedBiFunc.java:61)
        at com.zerocracy.farm.reactive.DefaultFlush.process(DefaultFlush.java:97)
        at com.zerocracy.farm.reactive.DefaultFlush.exec(DefaultFlush.java:70)
        at com.zerocracy.farm.reactive.DefaultFlush.exec(DefaultFlush.java:44)
        at com.zerocracy.farm.reactive.AsyncFlush.lambda$exec$2(AsyncFlush.java:118)
        at com.jcabi.log.VerboseCallable.call(VerboseCallable.java:173)
        at java.util.concurrent.FutureTask.run(FutureTask.java:266)
        at java.util.concurrent.ThreadPoolExecutor.runWorker(ThreadPoolExecutor.java:1142)
        at java.util.concurrent.ThreadPoolExecutor$Worker.run(ThreadPoolExecutor.java:617)
        at com.jcabi.log.VerboseThreads$Wrap.run(VerboseThreads.java:221)
        at java.lang.Thread.run(Thread.java:745)
Caused by: java.lang.IllegalStateException: java.lang.reflect.InvocationTargetException in com/zerocracy/stk/pm/comm/notify_in_github.groovy
        at com.zerocracy.farm.reactive.StkGroovy.process(StkGroovy.java:125)
        at com.zerocracy.farm.StkSafe.process(StkSafe.java:81)
        ... 32 more
Caused by: java.lang.reflect.InvocationTargetException
        at sun.reflect.GeneratedMethodAccessor211.invoke(Unknown Source)
        at sun.reflect.DelegatingMethodAccessorImpl.invoke(DelegatingMethodAccessorImpl.java:43)
        at java.lang.reflect.Method.invoke(Method.java:498)
        at com.zerocracy.farm.reactive.StkGroovy.process(StkGroovy.java:115)
        ... 33 more
Caused by: java.lang.IllegalArgumentException: repository test/test doesn't exist
        at com.jcabi.github.mock.MkRepos.get_aroundBody4(MkRepos.java:123)
        at com.jcabi.github.mock.MkRepos$AjcClosure5.run(MkRepos.java:1)
        at org.aspectj.runtime.reflect.JoinPointImpl.proceed(JoinPointImpl.java:149)
        at com.jcabi.aspects.aj.MethodLogger.wrap(MethodLogger.java:213)
        at com.jcabi.aspects.aj.MethodLogger.ajc$inlineAccessMethod$com_jcabi_aspects_aj_MethodLogger$com_jcabi_aspects_aj_MethodLogger$wrap(MethodLogger.java:1)
        at com.jcabi.aspects.aj.MethodLogger.wrapClass(MethodLogger.java:140)
        at com.jcabi.github.mock.MkRepos.get(MkRepos.java:118)
        at com.jcabi.github.Repos$get$3.call(Unknown Source)
        at com.zerocracy.stk.pm.comm.notify_in_github.exec(notify_in_github.groovy:57)
        ... 37 more

swallowed runtime exception: java.lang.IllegalStateException: java.lang.IllegalStateException: java.lang.reflect.InvocationTargetException in com/zerocracy/stk/pmo/awards/update_reputation.groovy
        at com.zerocracy.farm.StkSafe.process(StkSafe.java:115)
        at com.zerocracy.farm.reactive.StkSmart.process(StkSmart.java:66)
        at com.zerocracy.farm.reactive.Brigade.process(Brigade.java:82)
        at com.zerocracy.farm.reactive.Brigade.lambda$apply$0(Brigade.java:64)
        at org.cactoos.func.UncheckedFunc.lambda$apply$0(UncheckedFunc.java:58)
        at org.cactoos.scalar.IoCheckedScalar.value(IoCheckedScalar.java:70)
        at org.cactoos.scalar.UncheckedScalar.value(UncheckedScalar.java:58)
        at org.cactoos.func.UncheckedFunc.apply(UncheckedFunc.java:59)
        at org.cactoos.iterator.Filtered.hasNext(Filtered.java:90)
        at org.cactoos.iterator.LengthOf.lambda$new$0(LengthOf.java:52)
        at org.cactoos.scalar.IoCheckedScalar.value(IoCheckedScalar.java:70)
        at org.cactoos.scalar.UncheckedScalar.value(UncheckedScalar.java:58)
        at org.cactoos.scalar.NumberEnvelope.doubleValue(NumberEnvelope.java:113)
        at org.cactoos.iterable.LengthOf.lambda$new$0(LengthOf.java:51)
        at org.cactoos.scalar.NumberEnvelope.lambda$new$1(NumberEnvelope.java:73)
        at org.cactoos.scalar.IoCheckedScalar.value(IoCheckedScalar.java:70)
        at org.cactoos.scalar.UncheckedScalar.value(UncheckedScalar.java:58)
        at org.cactoos.scalar.NumberEnvelope.intValue(NumberEnvelope.java:98)
        at com.zerocracy.farm.reactive.Brigade.apply(Brigade.java:67)
        at com.zerocracy.farm.reactive.Brigade.apply(Brigade.java:37)
        at org.cactoos.func.IoCheckedBiFunc.lambda$apply$0(IoCheckedBiFunc.java:60)
        at org.cactoos.scalar.IoCheckedScalar.value(IoCheckedScalar.java:70)
        at org.cactoos.func.IoCheckedBiFunc.apply(IoCheckedBiFunc.java:61)
        at com.zerocracy.farm.reactive.DefaultFlush.process(DefaultFlush.java:97)
        at com.zerocracy.farm.reactive.DefaultFlush.exec(DefaultFlush.java:70)
        at com.zerocracy.farm.reactive.DefaultFlush.exec(DefaultFlush.java:44)
        at com.zerocracy.farm.reactive.AsyncFlush.lambda$exec$2(AsyncFlush.java:118)
        at com.jcabi.log.VerboseCallable.call(VerboseCallable.java:173)
        at java.util.concurrent.FutureTask.run(FutureTask.java:266)
        at java.util.concurrent.ThreadPoolExecutor.runWorker(ThreadPoolExecutor.java:1142)
        at java.util.concurrent.ThreadPoolExecutor$Worker.run(ThreadPoolExecutor.java:617)
        at com.jcabi.log.VerboseThreads$Wrap.run(VerboseThreads.java:221)
        at java.lang.Thread.run(Thread.java:745)
Caused by: java.lang.IllegalStateException: java.lang.reflect.InvocationTargetException in com/zerocracy/stk/pmo/awards/update_reputation.groovy
        at com.zerocracy.farm.reactive.StkGroovy.process(StkGroovy.java:125)
        at com.zerocracy.farm.StkSafe.process(StkSafe.java:81)
        ... 32 more
Caused by: java.lang.reflect.InvocationTargetException
        at sun.reflect.GeneratedMethodAccessor108.invoke(Unknown Source)
        at sun.reflect.DelegatingMethodAccessorImpl.invoke(DelegatingMethodAccessorImpl.java:43)
        at java.lang.reflect.Method.invoke(Method.java:498)
        at com.zerocracy.farm.reactive.StkGroovy.process(StkGroovy.java:115)
        ... 33 more
Caused by: java.lang.IllegalArgumentException: Person @yegor256[/z](https://www.0crat.com/u/yegor256) doesn't exist
        at com.zerocracy.pmo.People.reputation(People.java:656)
        at com.zerocracy.pmo.People$reputation$7.call(Unknown Source)
        at com.zerocracy.stk.pmo.awards.update_reputation.exec(update_reputation.groovy:34)
        ... 37 more

swallowed runtime exception: java.lang.IllegalStateException: java.lang.IllegalStateException: java.lang.reflect.InvocationTargetException in com/zerocracy/stk/pm/comm/notify_job.groovy
        at com.zerocracy.farm.StkSafe.process(StkSafe.java:115)
        at com.zerocracy.farm.reactive.StkSmart.process(StkSmart.java:66)
        at com.zerocracy.farm.reactive.Brigade.process(Brigade.java:82)
        at com.zerocracy.farm.reactive.Brigade.lambda$apply$0(Brigade.java:64)
        at org.cactoos.func.UncheckedFunc.lambda$apply$0(UncheckedFunc.java:58)
        at org.cactoos.scalar.IoCheckedScalar.value(IoCheckedScalar.java:70)
        at org.cactoos.scalar.UncheckedScalar.value(UncheckedScalar.java:58)
        at org.cactoos.func.UncheckedFunc.apply(UncheckedFunc.java:59)
        at org.cactoos.iterator.Filtered.hasNext(Filtered.java:90)
        at org.cactoos.iterator.LengthOf.lambda$new$0(LengthOf.java:52)
        at org.cactoos.scalar.IoCheckedScalar.value(IoCheckedScalar.java:70)
        at org.cactoos.scalar.UncheckedScalar.value(UncheckedScalar.java:58)
        at org.cactoos.scalar.NumberEnvelope.doubleValue(NumberEnvelope.java:113)
        at org.cactoos.iterable.LengthOf.lambda$new$0(LengthOf.java:51)
        at org.cactoos.scalar.NumberEnvelope.lambda$new$1(NumberEnvelope.java:73)
        at org.cactoos.scalar.IoCheckedScalar.value(IoCheckedScalar.java:70)
        at org.cactoos.scalar.UncheckedScalar.value(UncheckedScalar.java:58)
        at org.cactoos.scalar.NumberEnvelope.intValue(NumberEnvelope.java:98)
        at com.zerocracy.farm.reactive.Brigade.apply(Brigade.java:67)
        at com.zerocracy.farm.reactive.Brigade.apply(Brigade.java:37)
        at org.cactoos.func.IoCheckedBiFunc.lambda$apply$0(IoCheckedBiFunc.java:60)
        at org.cactoos.scalar.IoCheckedScalar.value(IoCheckedScalar.java:70)
        at org.cactoos.func.IoCheckedBiFunc.apply(IoCheckedBiFunc.java:61)
        at com.zerocracy.farm.reactive.DefaultFlush.process(DefaultFlush.java:97)
        at com.zerocracy.farm.reactive.DefaultFlush.exec(DefaultFlush.java:70)
        at com.zerocracy.farm.reactive.DefaultFlush.exec(DefaultFlush.java:44)
        at com.zerocracy.farm.reactive.AsyncFlush.lambda$exec$2(AsyncFlush.java:118)
        at com.jcabi.log.VerboseCallable.call(VerboseCallable.java:173)
        at java.util.concurrent.FutureTask.run(FutureTask.java:266)
        at java.util.concurrent.ThreadPoolExecutor.runWorker(ThreadPoolExecutor.java:1142)
        at java.util.concurrent.ThreadPoolExecutor$Worker.run(ThreadPoolExecutor.java:617)
        at com.jcabi.log.VerboseThreads$Wrap.run(VerboseThreads.java:221)
        at java.lang.Thread.run(Thread.java:745)
Caused by: java.lang.IllegalStateException: java.lang.reflect.InvocationTargetException in com/zerocracy/stk/pm/comm/notify_job.groovy
        at com.zerocracy.farm.reactive.StkGroovy.process(StkGroovy.java:125)
        at com.zerocracy.farm.StkSafe.process(StkSafe.java:81)
        ... 32 more
Caused by: java.lang.reflect.InvocationTargetException
        at sun.reflect.GeneratedMethodAccessor124.invoke(Unknown Source)
        at sun.reflect.DelegatingMethodAccessorImpl.invoke(DelegatingMethodAccessorImpl.java:43)
        at java.lang.reflect.Method.invoke(Method.java:498)
        at com.zerocracy.farm.reactive.StkGroovy.process(StkGroovy.java:115)
        ... 33 more
Caused by: java.lang.IllegalStateException: I don't know how to notify job "none"
        at sun.reflect.NativeConstructorAccessorImpl.newInstance0(Native Method)
        at sun.reflect.NativeConstructorAccessorImpl.newInstance(NativeConstructorAccessorImpl.java:62)
        at sun.reflect.DelegatingConstructorAccessorImpl.newInstance(DelegatingConstructorAccessorImpl.java:45)
        at java.lang.reflect.Constructor.newInstance(Constructor.java:423)
        at org.codehaus.groovy.reflection.CachedConstructor.invoke(CachedConstructor.java:77)
        at org.codehaus.groovy.runtime.callsite.ConstructorSite$ConstructorSiteNoUnwrapNoCoerce.callConstructor(ConstructorSite.java:102)
        at org.codehaus.groovy.runtime.callsite.CallSiteArray.defaultCallConstructor(CallSiteArray.java:57)
        at org.codehaus.groovy.runtime.callsite.AbstractCallSite.callConstructor(AbstractCallSite.java:182)
        at org.codehaus.groovy.runtime.callsite.AbstractCallSite.callConstructor(AbstractCallSite.java:190)
        at com.zerocracy.stk.pm.comm.notify_job.exec(notify_job.groovy:51)
        ... 37 more

swallowed runtime exception: java.lang.IllegalStateException: java.lang.IllegalStateException: java.lang.reflect.InvocationTargetException in com/zerocracy/stk/pmo/awards/update_reputation.groovy
        at com.zerocracy.farm.StkSafe.process(StkSafe.java:115)
        at com.zerocracy.farm.reactive.StkSmart.process(StkSmart.java:66)
        at com.zerocracy.farm.reactive.Brigade.process(Brigade.java:82)
        at com.zerocracy.farm.reactive.Brigade.lambda$apply$0(Brigade.java:64)
        at org.cactoos.func.UncheckedFunc.lambda$apply$0(UncheckedFunc.java:58)
        at org.cactoos.scalar.IoCheckedScalar.value(IoCheckedScalar.java:70)
        at org.cactoos.scalar.UncheckedScalar.value(UncheckedScalar.java:58)
        at org.cactoos.func.UncheckedFunc.apply(UncheckedFunc.java:59)
        at org.cactoos.iterator.Filtered.hasNext(Filtered.java:90)
        at org.cactoos.iterator.LengthOf.lambda$new$0(LengthOf.java:52)
        at org.cactoos.scalar.IoCheckedScalar.value(IoCheckedScalar.java:70)
        at org.cactoos.scalar.UncheckedScalar.value(UncheckedScalar.java:58)
        at org.cactoos.scalar.NumberEnvelope.doubleValue(NumberEnvelope.java:113)
        at org.cactoos.iterable.LengthOf.lambda$new$0(LengthOf.java:51)
        at org.cactoos.scalar.NumberEnvelope.lambda$new$1(NumberEnvelope.java:73)
        at org.cactoos.scalar.IoCheckedScalar.value(IoCheckedScalar.java:70)
        at org.cactoos.scalar.UncheckedScalar.value(UncheckedScalar.java:58)
        at org.cactoos.scalar.NumberEnvelope.intValue(NumberEnvelope.java:98)
        at com.zerocracy.farm.reactive.Brigade.apply(Brigade.java:67)
        at com.zerocracy.farm.reactive.Brigade.apply(Brigade.java:37)
        at org.cactoos.func.IoCheckedBiFunc.lambda$apply$0(IoCheckedBiFunc.java:60)
        at org.cactoos.scalar.IoCheckedScalar.value(IoCheckedScalar.java:70)
        at org.cactoos.func.IoCheckedBiFunc.apply(IoCheckedBiFunc.java:61)
        at com.zerocracy.farm.reactive.DefaultFlush.process(DefaultFlush.java:97)
        at com.zerocracy.farm.reactive.DefaultFlush.exec(DefaultFlush.java:70)
        at com.zerocracy.farm.reactive.DefaultFlush.exec(DefaultFlush.java:44)
        at com.zerocracy.farm.reactive.AsyncFlush.lambda$exec$2(AsyncFlush.java:118)
        at com.jcabi.log.VerboseCallable.call(VerboseCallable.java:173)
        at java.util.concurrent.FutureTask.run(FutureTask.java:266)
        at java.util.concurrent.ThreadPoolExecutor.runWorker(ThreadPoolExecutor.java:1142)
        at java.util.concurrent.ThreadPoolExecutor$Worker.run(ThreadPoolExecutor.java:617)
        at com.jcabi.log.VerboseThreads$Wrap.run(VerboseThreads.java:221)
        at java.lang.Thread.run(Thread.java:745)
Caused by: java.lang.IllegalStateException: java.lang.reflect.InvocationTargetException in com/zerocracy/stk/pmo/awards/update_reputation.groovy
        at com.zerocracy.farm.reactive.StkGroovy.process(StkGroovy.java:125)
        at com.zerocracy.farm.StkSafe.process(StkSafe.java:81)
        ... 32 more
Caused by: java.lang.reflect.InvocationTargetException
        at sun.reflect.GeneratedMethodAccessor108.invoke(Unknown Source)
        at sun.reflect.DelegatingMethodAccessorImpl.invoke(DelegatingMethodAccessorImpl.java:43)
        at java.lang.reflect.Method.invoke(Method.java:498)
        at com.zerocracy.farm.reactive.StkGroovy.process(StkGroovy.java:115)
        ... 33 more
Caused by: java.lang.IllegalArgumentException: Person @yegor256[/z](https://www.0crat.com/u/yegor256) doesn't exist
        at com.zerocracy.pmo.People.reputation(People.java:656)
        at com.zerocracy.pmo.People$reputation$7.call(Unknown Source)
        at com.zerocracy.stk.pmo.awards.update_reputation.exec(update_reputation.groovy:34)
        ... 37 more

swallowed runtime exception: java.lang.IllegalStateException: java.lang.IllegalStateException: java.lang.reflect.InvocationTargetException in com/zerocracy/stk/pmo/awards/update_reputation.groovy
        at com.zerocracy.farm.StkSafe.process(StkSafe.java:115)
        at com.zerocracy.farm.reactive.StkSmart.process(StkSmart.java:66)
        at com.zerocracy.farm.reactive.Brigade.process(Brigade.java:82)
        at com.zerocracy.farm.reactive.Brigade.lambda$apply$0(Brigade.java:64)
        at org.cactoos.func.UncheckedFunc.lambda$apply$0(UncheckedFunc.java:58)
        at org.cactoos.scalar.IoCheckedScalar.value(IoCheckedScalar.java:70)
        at org.cactoos.scalar.UncheckedScalar.value(UncheckedScalar.java:58)
        at org.cactoos.func.UncheckedFunc.apply(UncheckedFunc.java:59)
        at org.cactoos.iterator.Filtered.hasNext(Filtered.java:90)
        at org.cactoos.iterator.LengthOf.lambda$new$0(LengthOf.java:52)
        at org.cactoos.scalar.IoCheckedScalar.value(IoCheckedScalar.java:70)
        at org.cactoos.scalar.UncheckedScalar.value(UncheckedScalar.java:58)
        at org.cactoos.scalar.NumberEnvelope.doubleValue(NumberEnvelope.java:113)
        at org.cactoos.iterable.LengthOf.lambda$new$0(LengthOf.java:51)
        at org.cactoos.scalar.NumberEnvelope.lambda$new$1(NumberEnvelope.java:73)
        at org.cactoos.scalar.IoCheckedScalar.value(IoCheckedScalar.java:70)
        at org.cactoos.scalar.UncheckedScalar.value(UncheckedScalar.java:58)
        at org.cactoos.scalar.NumberEnvelope.intValue(NumberEnvelope.java:98)
        at com.zerocracy.farm.reactive.Brigade.apply(Brigade.java:67)
        at com.zerocracy.farm.reactive.Brigade.apply(Brigade.java:37)
        at org.cactoos.func.IoCheckedBiFunc.lambda$apply$0(IoCheckedBiFunc.java:60)
        at org.cactoos.scalar.IoCheckedScalar.value(IoCheckedScalar.java:70)
        at org.cactoos.func.IoCheckedBiFunc.apply(IoCheckedBiFunc.java:61)
        at com.zerocracy.farm.reactive.DefaultFlush.process(DefaultFlush.java:97)
        at com.zerocracy.farm.reactive.DefaultFlush.exec(DefaultFlush.java:70)
        at com.zerocracy.farm.reactive.DefaultFlush.exec(DefaultFlush.java:44)
        at com.zerocracy.farm.reactive.AsyncFlush.lambda$exec$2(AsyncFlush.java:118)
        at com.jcabi.log.VerboseCallable.call(VerboseCallable.java:173)
        at java.util.concurrent.FutureTask.run(FutureTask.java:266)
        at java.util.concurrent.ThreadPoolExecutor.runWorker(ThreadPoolExecutor.java:1142)
        at java.util.concurrent.ThreadPoolExecutor$Worker.run(ThreadPoolExecutor.java:617)
        at com.jcabi.log.VerboseThreads$Wrap.run(VerboseThreads.java:221)
        at java.lang.Thread.run(Thread.java:745)
Caused by: java.lang.IllegalStateException: java.lang.reflect.InvocationTargetException in com/zerocracy/stk/pmo/awards/update_reputation.groovy
        at com.zerocracy.farm.reactive.StkGroovy.process(StkGroovy.java:125)
        at com.zerocracy.farm.StkSafe.process(StkSafe.java:81)
        ... 32 more
Caused by: java.lang.reflect.InvocationTargetException
        at sun.reflect.GeneratedMethodAccessor108.invoke(Unknown Source)
        at sun.reflect.DelegatingMethodAccessorImpl.invoke(DelegatingMethodAccessorImpl.java:43)
        at java.lang.reflect.Method.invoke(Method.java:498)
        at com.zerocracy.farm.reactive.StkGroovy.process(StkGroovy.java:115)
        ... 33 more
Caused by: java.lang.IllegalArgumentException: Person @coder[/z](https://www.0crat.com/u/coder) doesn't exist
        at com.zerocracy.pmo.People.reputation(People.java:656)
        at com.zerocracy.pmo.People$reputation$7.call(Unknown Source)
        at com.zerocracy.stk.pmo.awards.update_reputation.exec(update_reputation.groovy:34)
        ... 37 more

swallowed runtime exception: java.lang.IllegalStateException: java.lang.IllegalStateException: java.lang.reflect.InvocationTargetException in com/zerocracy/stk/pmo/awards/update_reputation.groovy
        at com.zerocracy.farm.StkSafe.process(StkSafe.java:115)
        at com.zerocracy.farm.reactive.StkSmart.process(StkSmart.java:66)
        at com.zerocracy.farm.reactive.Brigade.process(Brigade.java:82)
        at com.zerocracy.farm.reactive.Brigade.lambda$apply$0(Brigade.java:64)
        at org.cactoos.func.UncheckedFunc.lambda$apply$0(UncheckedFunc.java:58)
        at org.cactoos.scalar.IoCheckedScalar.value(IoCheckedScalar.java:70)
        at org.cactoos.scalar.UncheckedScalar.value(UncheckedScalar.java:58)
        at org.cactoos.func.UncheckedFunc.apply(UncheckedFunc.java:59)
        at org.cactoos.iterator.Filtered.hasNext(Filtered.java:90)
        at org.cactoos.iterator.LengthOf.lambda$new$0(LengthOf.java:52)
        at org.cactoos.scalar.IoCheckedScalar.value(IoCheckedScalar.java:70)
        at org.cactoos.scalar.UncheckedScalar.value(UncheckedScalar.java:58)
        at org.cactoos.scalar.NumberEnvelope.doubleValue(NumberEnvelope.java:113)
        at org.cactoos.iterable.LengthOf.lambda$new$0(LengthOf.java:51)
        at org.cactoos.scalar.NumberEnvelope.lambda$new$1(NumberEnvelope.java:73)
        at org.cactoos.scalar.IoCheckedScalar.value(IoCheckedScalar.java:70)
        at org.cactoos.scalar.UncheckedScalar.value(UncheckedScalar.java:58)
        at org.cactoos.scalar.NumberEnvelope.intValue(NumberEnvelope.java:98)
        at com.zerocracy.farm.reactive.Brigade.apply(Brigade.java:67)
        at com.zerocracy.farm.reactive.Brigade.apply(Brigade.java:37)
        at org.cactoos.func.IoCheckedBiFunc.lambda$apply$0(IoCheckedBiFunc.java:60)
        at org.cactoos.scalar.IoCheckedScalar.value(IoCheckedScalar.java:70)
        at org.cactoos.func.IoCheckedBiFunc.apply(IoCheckedBiFunc.java:61)
        at com.zerocracy.farm.reactive.DefaultFlush.process(DefaultFlush.java:97)
        at com.zerocracy.farm.reactive.DefaultFlush.exec(DefaultFlush.java:70)
        at com.zerocracy.farm.reactive.DefaultFlush.exec(DefaultFlush.java:44)
        at com.zerocracy.farm.reactive.AsyncFlush.lambda$exec$2(AsyncFlush.java:118)
        at com.jcabi.log.VerboseCallable.call(VerboseCallable.java:173)
        at java.util.concurrent.FutureTask.run(FutureTask.java:266)
        at java.util.concurrent.ThreadPoolExecutor.runWorker(ThreadPoolExecutor.java:1142)
        at java.util.concurrent.ThreadPoolExecutor$Worker.run(ThreadPoolExecutor.java:617)
        at com.jcabi.log.VerboseThreads$Wrap.run(VerboseThreads.java:221)
        at java.lang.Thread.run(Thread.java:745)
Caused by: java.lang.IllegalStateException: java.lang.reflect.InvocationTargetException in com/zerocracy/stk/pmo/awards/update_reputation.groovy
        at com.zerocracy.farm.reactive.StkGroovy.process(StkGroovy.java:125)
        at com.zerocracy.farm.StkSafe.process(StkSafe.java:81)
        ... 32 more
Caused by: java.lang.reflect.InvocationTargetException
        at sun.reflect.GeneratedMethodAccessor108.invoke(Unknown Source)
        at sun.reflect.DelegatingMethodAccessorImpl.invoke(DelegatingMethodAccessorImpl.java:43)
        at java.lang.reflect.Method.invoke(Method.java:498)
        at com.zerocracy.farm.reactive.StkGroovy.process(StkGroovy.java:115)
        ... 33 more
Caused by: java.lang.IllegalArgumentException: Person @qa-guy[/z](https://www.0crat.com/u/qa-guy) doesn't exist
        at com.zerocracy.pmo.People.reputation(People.java:656)
        at com.zerocracy.pmo.People$reputation$7.call(Unknown Source)
        at com.zerocracy.stk.pmo.awards.update_reputation.exec(update_reputation.groovy:34)
        ... 37 more

swallowed runtime exception: java.lang.IllegalStateException: java.lang.IllegalStateException: java.lang.reflect.InvocationTargetException in com/zerocracy/stk/pmo/awards/update_reputation.groovy
        at com.zerocracy.farm.StkSafe.process(StkSafe.java:115)
        at com.zerocracy.farm.reactive.StkSmart.process(StkSmart.java:66)
        at com.zerocracy.farm.reactive.Brigade.process(Brigade.java:82)
        at com.zerocracy.farm.reactive.Brigade.lambda$apply$0(Brigade.java:64)
        at org.cactoos.func.UncheckedFunc.lambda$apply$0(UncheckedFunc.java:58)
        at org.cactoos.scalar.IoCheckedScalar.value(IoCheckedScalar.java:70)
        at org.cactoos.scalar.UncheckedScalar.value(UncheckedScalar.java:58)
        at org.cactoos.func.UncheckedFunc.apply(UncheckedFunc.java:59)
        at org.cactoos.iterator.Filtered.hasNext(Filtered.java:90)
        at org.cactoos.iterator.LengthOf.lambda$new$0(LengthOf.java:52)
        at org.cactoos.scalar.IoCheckedScalar.value(IoCheckedScalar.java:70)
        at org.cactoos.scalar.UncheckedScalar.value(UncheckedScalar.java:58)
        at org.cactoos.scalar.NumberEnvelope.doubleValue(NumberEnvelope.java:113)
        at org.cactoos.iterable.LengthOf.lambda$new$0(LengthOf.java:51)
        at org.cactoos.scalar.NumberEnvelope.lambda$new$1(NumberEnvelope.java:73)
        at org.cactoos.scalar.IoCheckedScalar.value(IoCheckedScalar.java:70)
        at org.cactoos.scalar.UncheckedScalar.value(UncheckedScalar.java:58)
        at org.cactoos.scalar.NumberEnvelope.intValue(NumberEnvelope.java:98)
        at com.zerocracy.farm.reactive.Brigade.apply(Brigade.java:67)
        at com.zerocracy.farm.reactive.Brigade.apply(Brigade.java:37)
        at org.cactoos.func.IoCheckedBiFunc.lambda$apply$0(IoCheckedBiFunc.java:60)
        at org.cactoos.scalar.IoCheckedScalar.value(IoCheckedScalar.java:70)
        at org.cactoos.func.IoCheckedBiFunc.apply(IoCheckedBiFunc.java:61)
        at com.zerocracy.farm.reactive.DefaultFlush.process(DefaultFlush.java:97)
        at com.zerocracy.farm.reactive.DefaultFlush.exec(DefaultFlush.java:70)
        at com.zerocracy.farm.reactive.DefaultFlush.exec(DefaultFlush.java:44)
        at com.zerocracy.farm.reactive.AsyncFlush.lambda$exec$2(AsyncFlush.java:118)
        at com.jcabi.log.VerboseCallable.call(VerboseCallable.java:173)
        at java.util.concurrent.FutureTask.run(FutureTask.java:266)
        at java.util.concurrent.ThreadPoolExecutor.runWorker(ThreadPoolExecutor.java:1142)
        at java.util.concurrent.ThreadPoolExecutor$Worker.run(ThreadPoolExecutor.java:617)
        at com.jcabi.log.VerboseThreads$Wrap.run(VerboseThreads.java:221)
        at java.lang.Thread.run(Thread.java:745)
Caused by: java.lang.IllegalStateException: java.lang.reflect.InvocationTargetException in com/zerocracy/stk/pmo/awards/update_reputation.groovy
        at com.zerocracy.farm.reactive.StkGroovy.process(StkGroovy.java:125)
        at com.zerocracy.farm.StkSafe.process(StkSafe.java:81)
        ... 32 more
Caused by: java.lang.reflect.InvocationTargetException
        at sun.reflect.GeneratedMethodAccessor108.invoke(Unknown Source)
        at sun.reflect.DelegatingMethodAccessorImpl.invoke(DelegatingMethodAccessorImpl.java:43)
        at java.lang.reflect.Method.invoke(Method.java:498)
        at com.zerocracy.farm.reactive.StkGroovy.process(StkGroovy.java:115)
        ... 33 more
Caused by: java.lang.IllegalArgumentException: Person @g4s8[/z](https://www.0crat.com/u/g4s8) doesn't exist
        at com.zerocracy.pmo.People.reputation(People.java:656)
        at com.zerocracy.pmo.People$reputation$7.call(Unknown Source)
        at com.zerocracy.stk.pmo.awards.update_reputation.exec(update_reputation.groovy:34)
        ... 37 more

swallowed runtime exception: java.lang.IllegalStateException: java.lang.IllegalStateException: java.lang.reflect.InvocationTargetException in com/zerocracy/stk/pmo/awards/update_reputation.groovy
        at com.zerocracy.farm.StkSafe.process(StkSafe.java:115)
        at com.zerocracy.farm.reactive.StkSmart.process(StkSmart.java:66)
        at com.zerocracy.farm.reactive.Brigade.process(Brigade.java:82)
        at com.zerocracy.farm.reactive.Brigade.lambda$apply$0(Brigade.java:64)
        at org.cactoos.func.UncheckedFunc.lambda$apply$0(UncheckedFunc.java:58)
        at org.cactoos.scalar.IoCheckedScalar.value(IoCheckedScalar.java:70)
        at org.cactoos.scalar.UncheckedScalar.value(UncheckedScalar.java:58)
        at org.cactoos.func.UncheckedFunc.apply(UncheckedFunc.java:59)
        at org.cactoos.iterator.Filtered.hasNext(Filtered.java:90)
        at org.cactoos.iterator.LengthOf.lambda$new$0(LengthOf.java:52)
        at org.cactoos.scalar.IoCheckedScalar.value(IoCheckedScalar.java:70)
        at org.cactoos.scalar.UncheckedScalar.value(UncheckedScalar.java:58)
        at org.cactoos.scalar.NumberEnvelope.doubleValue(NumberEnvelope.java:113)
        at org.cactoos.iterable.LengthOf.lambda$new$0(LengthOf.java:51)
        at org.cactoos.scalar.NumberEnvelope.lambda$new$1(NumberEnvelope.java:73)
        at org.cactoos.scalar.IoCheckedScalar.value(IoCheckedScalar.java:70)
        at org.cactoos.scalar.UncheckedScalar.value(UncheckedScalar.java:58)
        at org.cactoos.scalar.NumberEnvelope.intValue(NumberEnvelope.java:98)
        at com.zerocracy.farm.reactive.Brigade.apply(Brigade.java:67)
        at com.zerocracy.farm.reactive.Brigade.apply(Brigade.java:37)
        at org.cactoos.func.IoCheckedBiFunc.lambda$apply$0(IoCheckedBiFunc.java:60)
        at org.cactoos.scalar.IoCheckedScalar.value(IoCheckedScalar.java:70)
        at org.cactoos.func.IoCheckedBiFunc.apply(IoCheckedBiFunc.java:61)
        at com.zerocracy.farm.reactive.DefaultFlush.process(DefaultFlush.java:97)
        at com.zerocracy.farm.reactive.DefaultFlush.exec(DefaultFlush.java:70)
        at com.zerocracy.farm.reactive.DefaultFlush.exec(DefaultFlush.java:44)
        at com.zerocracy.farm.reactive.AsyncFlush.lambda$exec$2(AsyncFlush.java:118)
        at com.jcabi.log.VerboseCallable.call(VerboseCallable.java:173)
        at java.util.concurrent.FutureTask.run(FutureTask.java:266)
        at java.util.concurrent.ThreadPoolExecutor.runWorker(ThreadPoolExecutor.java:1142)
        at java.util.concurrent.ThreadPoolExecutor$Worker.run(ThreadPoolExecutor.java:617)
        at com.jcabi.log.VerboseThreads$Wrap.run(VerboseThreads.java:221)
        at java.lang.Thread.run(Thread.java:745)
Caused by: java.lang.IllegalStateException: java.lang.reflect.InvocationTargetException in com/zerocracy/stk/pmo/awards/update_reputation.groovy
        at com.zerocracy.farm.reactive.StkGroovy.process(StkGroovy.java:125)
        at com.zerocracy.farm.StkSafe.process(StkSafe.java:81)
        ... 32 more
Caused by: java.lang.reflect.InvocationTargetException
        at sun.reflect.GeneratedMethodAccessor108.invoke(Unknown Source)
        at sun.reflect.DelegatingMethodAccessorImpl.invoke(DelegatingMethodAccessorImpl.java:43)
        at java.lang.reflect.Method.invoke(Method.java:498)
        at com.zerocracy.farm.reactive.StkGroovy.process(StkGroovy.java:115)
        ... 33 more
Caused by: java.lang.IllegalArgumentException: Person @yegor256[/z](https://www.0crat.com/u/yegor256) doesn't exist
        at com.zerocracy.pmo.People.reputation(People.java:656)
        at com.zerocracy.pmo.People$reputation$7.call(Unknown Source)
        at com.zerocracy.stk.pmo.awards.update_reputation.exec(update_reputation.groovy:34)
        ... 37 more

swallowed runtime exception: java.lang.IllegalStateException: java.lang.IllegalStateException: java.lang.reflect.InvocationTargetException in com/zerocracy/stk/pm/scope/wbs/add_job_to_wbs.groovy
        at com.zerocracy.farm.StkSafe.process(StkSafe.java:115)
        at com.zerocracy.farm.reactive.StkSmart.process(StkSmart.java:66)
        at com.zerocracy.farm.reactive.Brigade.process(Brigade.java:82)
        at com.zerocracy.farm.reactive.Brigade.lambda$apply$0(Brigade.java:64)
        at org.cactoos.func.UncheckedFunc.lambda$apply$0(UncheckedFunc.java:58)
        at org.cactoos.scalar.IoCheckedScalar.value(IoCheckedScalar.java:70)
        at org.cactoos.scalar.UncheckedScalar.value(UncheckedScalar.java:58)
        at org.cactoos.func.UncheckedFunc.apply(UncheckedFunc.java:59)
        at org.cactoos.iterator.Filtered.hasNext(Filtered.java:90)
        at org.cactoos.iterator.LengthOf.lambda$new$0(LengthOf.java:52)
        at org.cactoos.scalar.IoCheckedScalar.value(IoCheckedScalar.java:70)
        at org.cactoos.scalar.UncheckedScalar.value(UncheckedScalar.java:58)
        at org.cactoos.scalar.NumberEnvelope.doubleValue(NumberEnvelope.java:113)
        at org.cactoos.iterable.LengthOf.lambda$new$0(LengthOf.java:51)
        at org.cactoos.scalar.NumberEnvelope.lambda$new$1(NumberEnvelope.java:73)
        at org.cactoos.scalar.IoCheckedScalar.value(IoCheckedScalar.java:70)
        at org.cactoos.scalar.UncheckedScalar.value(UncheckedScalar.java:58)
        at org.cactoos.scalar.NumberEnvelope.intValue(NumberEnvelope.java:98)
        at com.zerocracy.farm.reactive.Brigade.apply(Brigade.java:67)
        at com.zerocracy.farm.reactive.Brigade.apply(Brigade.java:37)
        at org.cactoos.func.IoCheckedBiFunc.lambda$apply$0(IoCheckedBiFunc.java:60)
        at org.cactoos.scalar.IoCheckedScalar.value(IoCheckedScalar.java:70)
        at org.cactoos.func.IoCheckedBiFunc.apply(IoCheckedBiFunc.java:61)
        at com.zerocracy.farm.reactive.DefaultFlush.process(DefaultFlush.java:97)
        at com.zerocracy.farm.reactive.DefaultFlush.exec(DefaultFlush.java:70)
        at com.zerocracy.farm.reactive.DefaultFlush.exec(DefaultFlush.java:44)
        at com.zerocracy.farm.reactive.AsyncFlush.lambda$exec$2(AsyncFlush.java:118)
        at com.jcabi.log.VerboseCallable.call(VerboseCallable.java:173)
        at java.util.concurrent.FutureTask.run(FutureTask.java:266)
        at java.util.concurrent.ThreadPoolExecutor.runWorker(ThreadPoolExecutor.java:1142)
        at java.util.concurrent.ThreadPoolExecutor$Worker.run(ThreadPoolExecutor.java:617)
        at com.jcabi.log.VerboseThreads$Wrap.run(VerboseThreads.java:221)
        at java.lang.Thread.run(Thread.java:745)
Caused by: java.lang.IllegalStateException: java.lang.reflect.InvocationTargetException in com/zerocracy/stk/pm/scope/wbs/add_job_to_wbs.groovy
        at com.zerocracy.farm.reactive.StkGroovy.process(StkGroovy.java:125)
        at com.zerocracy.farm.StkSafe.process(StkSafe.java:81)
        ... 32 more
Caused by: java.lang.reflect.InvocationTargetException
        at sun.reflect.GeneratedMethodAccessor64.invoke(Unknown Source)
        at sun.reflect.DelegatingMethodAccessorImpl.invoke(DelegatingMethodAccessorImpl.java:43)
        at java.lang.reflect.Method.invoke(Method.java:498)
        at com.zerocracy.farm.reactive.StkGroovy.process(StkGroovy.java:115)
        ... 33 more
Caused by: java.lang.NullPointerException
        at org.glassfish.json.JsonObjectBuilderImpl$JsonObjectImpl.getInt(JsonObjectBuilderImpl.java:271)
        at javax.json.JsonObject$getInt.call(Unknown Source)
        at com.zerocracy.stk.pm.scope.wbs.add_job_to_wbs.exec(add_job_to_wbs.groovy:57)
        ... 37 more

swallowed runtime exception: java.lang.IllegalStateException: java.lang.IllegalStateException: java.lang.reflect.InvocationTargetException in com/zerocracy/stk/pmo/awards/update_reputation.groovy
        at com.zerocracy.farm.StkSafe.process(StkSafe.java:115)
        at com.zerocracy.farm.reactive.StkSmart.process(StkSmart.java:66)
        at com.zerocracy.farm.reactive.Brigade.process(Brigade.java:82)
        at com.zerocracy.farm.reactive.Brigade.lambda$apply$0(Brigade.java:64)
        at org.cactoos.func.UncheckedFunc.lambda$apply$0(UncheckedFunc.java:58)
        at org.cactoos.scalar.IoCheckedScalar.value(IoCheckedScalar.java:70)
        at org.cactoos.scalar.UncheckedScalar.value(UncheckedScalar.java:58)
        at org.cactoos.func.UncheckedFunc.apply(UncheckedFunc.java:59)
        at org.cactoos.iterator.Filtered.hasNext(Filtered.java:90)
        at org.cactoos.iterator.LengthOf.lambda$new$0(LengthOf.java:52)
        at org.cactoos.scalar.IoCheckedScalar.value(IoCheckedScalar.java:70)
        at org.cactoos.scalar.UncheckedScalar.value(UncheckedScalar.java:58)
        at org.cactoos.scalar.NumberEnvelope.doubleValue(NumberEnvelope.java:113)
        at org.cactoos.iterable.LengthOf.lambda$new$0(LengthOf.java:51)
        at org.cactoos.scalar.NumberEnvelope.lambda$new$1(NumberEnvelope.java:73)
        at org.cactoos.scalar.IoCheckedScalar.value(IoCheckedScalar.java:70)
        at org.cactoos.scalar.UncheckedScalar.value(UncheckedScalar.java:58)
        at org.cactoos.scalar.NumberEnvelope.intValue(NumberEnvelope.java:98)
        at com.zerocracy.farm.reactive.Brigade.apply(Brigade.java:67)
        at com.zerocracy.farm.reactive.Brigade.apply(Brigade.java:37)
        at org.cactoos.func.IoCheckedBiFunc.lambda$apply$0(IoCheckedBiFunc.java:60)
        at org.cactoos.scalar.IoCheckedScalar.value(IoCheckedScalar.java:70)
        at org.cactoos.func.IoCheckedBiFunc.apply(IoCheckedBiFunc.java:61)
        at com.zerocracy.farm.reactive.DefaultFlush.process(DefaultFlush.java:97)
        at com.zerocracy.farm.reactive.DefaultFlush.exec(DefaultFlush.java:70)
        at com.zerocracy.farm.reactive.DefaultFlush.exec(DefaultFlush.java:44)
        at com.zerocracy.farm.reactive.AsyncFlush.lambda$exec$2(AsyncFlush.java:118)
        at com.jcabi.log.VerboseCallable.call(VerboseCallable.java:173)
        at java.util.concurrent.FutureTask.run(FutureTask.java:266)
        at java.util.concurrent.ThreadPoolExecutor.runWorker(ThreadPoolExecutor.java:1142)
        at java.util.concurrent.ThreadPoolExecutor$Worker.run(ThreadPoolExecutor.java:617)
        at com.jcabi.log.VerboseThreads$Wrap.run(VerboseThreads.java:221)
        at java.lang.Thread.run(Thread.java:745)
Caused by: java.lang.IllegalStateException: java.lang.reflect.InvocationTargetException in com/zerocracy/stk/pmo/awards/update_reputation.groovy
        at com.zerocracy.farm.reactive.StkGroovy.process(StkGroovy.java:125)
        at com.zerocracy.farm.StkSafe.process(StkSafe.java:81)
        ... 32 more
Caused by: java.lang.reflect.InvocationTargetException
        at sun.reflect.GeneratedMethodAccessor108.invoke(Unknown Source)
        at sun.reflect.DelegatingMethodAccessorImpl.invoke(DelegatingMethodAccessorImpl.java:43)
        at java.lang.reflect.Method.invoke(Method.java:498)
        at com.zerocracy.farm.reactive.StkGroovy.process(StkGroovy.java:115)
        ... 33 more
Caused by: java.lang.IllegalArgumentException: Person @yegor256[/z](https://www.0crat.com/u/yegor256) doesn't exist
        at com.zerocracy.pmo.People.reputation(People.java:656)
        at com.zerocracy.pmo.People$reputation$7.call(Unknown Source)
        at com.zerocracy.stk.pmo.awards.update_reputation.exec(update_reputation.groovy:34)
        ... 37 more

swallowed runtime exception: java.lang.IllegalStateException: java.lang.IllegalStateException: java.lang.reflect.InvocationTargetException in com/zerocracy/stk/pm/comm/notify_job.groovy
        at com.zerocracy.farm.StkSafe.process(StkSafe.java:115)
        at com.zerocracy.farm.reactive.StkSmart.process(StkSmart.java:66)
        at com.zerocracy.farm.reactive.Brigade.process(Brigade.java:82)
        at com.zerocracy.farm.reactive.Brigade.lambda$apply$0(Brigade.java:64)
        at org.cactoos.func.UncheckedFunc.lambda$apply$0(UncheckedFunc.java:58)
        at org.cactoos.scalar.IoCheckedScalar.value(IoCheckedScalar.java:70)
        at org.cactoos.scalar.UncheckedScalar.value(UncheckedScalar.java:58)
        at org.cactoos.func.UncheckedFunc.apply(UncheckedFunc.java:59)
        at org.cactoos.iterator.Filtered.hasNext(Filtered.java:90)
        at org.cactoos.iterator.LengthOf.lambda$new$0(LengthOf.java:52)
        at org.cactoos.scalar.IoCheckedScalar.value(IoCheckedScalar.java:70)
        at org.cactoos.scalar.UncheckedScalar.value(UncheckedScalar.java:58)
        at org.cactoos.scalar.NumberEnvelope.doubleValue(NumberEnvelope.java:113)
        at org.cactoos.iterable.LengthOf.lambda$new$0(LengthOf.java:51)
        at org.cactoos.scalar.NumberEnvelope.lambda$new$1(NumberEnvelope.java:73)
        at org.cactoos.scalar.IoCheckedScalar.value(IoCheckedScalar.java:70)
        at org.cactoos.scalar.UncheckedScalar.value(UncheckedScalar.java:58)
        at org.cactoos.scalar.NumberEnvelope.intValue(NumberEnvelope.java:98)
        at com.zerocracy.farm.reactive.Brigade.apply(Brigade.java:67)
        at com.zerocracy.farm.reactive.Brigade.apply(Brigade.java:37)
        at org.cactoos.func.IoCheckedBiFunc.lambda$apply$0(IoCheckedBiFunc.java:60)
        at org.cactoos.scalar.IoCheckedScalar.value(IoCheckedScalar.java:70)
        at org.cactoos.func.IoCheckedBiFunc.apply(IoCheckedBiFunc.java:61)
        at com.zerocracy.farm.reactive.DefaultFlush.process(DefaultFlush.java:97)
        at com.zerocracy.farm.reactive.DefaultFlush.exec(DefaultFlush.java:70)
        at com.zerocracy.farm.reactive.DefaultFlush.exec(DefaultFlush.java:44)
        at com.zerocracy.farm.reactive.AsyncFlush.lambda$exec$2(AsyncFlush.java:118)
        at com.jcabi.log.VerboseCallable.call(VerboseCallable.java:173)
        at java.util.concurrent.FutureTask.run(FutureTask.java:266)
        at java.util.concurrent.ThreadPoolExecutor.runWorker(ThreadPoolExecutor.java:1142)
        at java.util.concurrent.ThreadPoolExecutor$Worker.run(ThreadPoolExecutor.java:617)
        at com.jcabi.log.VerboseThreads$Wrap.run(VerboseThreads.java:221)
        at java.lang.Thread.run(Thread.java:745)
Caused by: java.lang.IllegalStateException: java.lang.reflect.InvocationTargetException in com/zerocracy/stk/pm/comm/notify_job.groovy
        at com.zerocracy.farm.reactive.StkGroovy.process(StkGroovy.java:125)
        at com.zerocracy.farm.StkSafe.process(StkSafe.java:81)
        ... 32 more
Caused by: java.lang.reflect.InvocationTargetException
        at sun.reflect.GeneratedMethodAccessor124.invoke(Unknown Source)
        at sun.reflect.DelegatingMethodAccessorImpl.invoke(DelegatingMethodAccessorImpl.java:43)
        at java.lang.reflect.Method.invoke(Method.java:498)
        at com.zerocracy.farm.reactive.StkGroovy.process(StkGroovy.java:115)
        ... 33 more
Caused by: java.lang.IllegalStateException: I don't know how to notify job "none"
        at sun.reflect.NativeConstructorAccessorImpl.newInstance0(Native Method)
        at sun.reflect.NativeConstructorAccessorImpl.newInstance(NativeConstructorAccessorImpl.java:62)
        at sun.reflect.DelegatingConstructorAccessorImpl.newInstance(DelegatingConstructorAccessorImpl.java:45)
        at java.lang.reflect.Constructor.newInstance(Constructor.java:423)
        at org.codehaus.groovy.reflection.CachedConstructor.invoke(CachedConstructor.java:77)
        at org.codehaus.groovy.runtime.callsite.ConstructorSite$ConstructorSiteNoUnwrapNoCoerce.callConstructor(ConstructorSite.java:102)
        at org.codehaus.groovy.runtime.callsite.AbstractCallSite.callConstructor(AbstractCallSite.java:190)
        at com.zerocracy.stk.pm.comm.notify_job.exec(notify_job.groovy:51)
        ... 37 more

swallowed runtime exception: java.lang.IllegalStateException: java.lang.IllegalStateException: java.lang.reflect.InvocationTargetException in com/zerocracy/stk/pmo/awards/update_reputation.groovy
        at com.zerocracy.farm.StkSafe.process(StkSafe.java:115)
        at com.zerocracy.farm.reactive.StkSmart.process(StkSmart.java:66)
        at com.zerocracy.farm.reactive.Brigade.process(Brigade.java:82)
        at com.zerocracy.farm.reactive.Brigade.lambda$apply$0(Brigade.java:64)
        at org.cactoos.func.UncheckedFunc.lambda$apply$0(UncheckedFunc.java:58)
        at org.cactoos.scalar.IoCheckedScalar.value(IoCheckedScalar.java:70)
        at org.cactoos.scalar.UncheckedScalar.value(UncheckedScalar.java:58)
        at org.cactoos.func.UncheckedFunc.apply(UncheckedFunc.java:59)
        at org.cactoos.iterator.Filtered.hasNext(Filtered.java:90)
        at org.cactoos.iterator.LengthOf.lambda$new$0(LengthOf.java:52)
        at org.cactoos.scalar.IoCheckedScalar.value(IoCheckedScalar.java:70)
        at org.cactoos.scalar.UncheckedScalar.value(UncheckedScalar.java:58)
        at org.cactoos.scalar.NumberEnvelope.doubleValue(NumberEnvelope.java:113)
        at org.cactoos.iterable.LengthOf.lambda$new$0(LengthOf.java:51)
        at org.cactoos.scalar.NumberEnvelope.lambda$new$1(NumberEnvelope.java:73)
        at org.cactoos.scalar.IoCheckedScalar.value(IoCheckedScalar.java:70)
        at org.cactoos.scalar.UncheckedScalar.value(UncheckedScalar.java:58)
        at org.cactoos.scalar.NumberEnvelope.intValue(NumberEnvelope.java:98)
        at com.zerocracy.farm.reactive.Brigade.apply(Brigade.java:67)
        at com.zerocracy.farm.reactive.Brigade.apply(Brigade.java:37)
        at org.cactoos.func.IoCheckedBiFunc.lambda$apply$0(IoCheckedBiFunc.java:60)
        at org.cactoos.scalar.IoCheckedScalar.value(IoCheckedScalar.java:70)
        at org.cactoos.func.IoCheckedBiFunc.apply(IoCheckedBiFunc.java:61)
        at com.zerocracy.farm.reactive.DefaultFlush.process(DefaultFlush.java:97)
        at com.zerocracy.farm.reactive.DefaultFlush.exec(DefaultFlush.java:70)
        at com.zerocracy.farm.reactive.DefaultFlush.exec(DefaultFlush.java:44)
        at com.zerocracy.farm.reactive.AsyncFlush.lambda$exec$2(AsyncFlush.java:118)
        at com.jcabi.log.VerboseCallable.call(VerboseCallable.java:173)
        at java.util.concurrent.FutureTask.run(FutureTask.java:266)
        at java.util.concurrent.ThreadPoolExecutor.runWorker(ThreadPoolExecutor.java:1142)
        at java.util.concurrent.ThreadPoolExecutor$Worker.run(ThreadPoolExecutor.java:617)
        at com.jcabi.log.VerboseThreads$Wrap.run(VerboseThreads.java:221)
        at java.lang.Thread.run(Thread.java:745)
Caused by: java.lang.IllegalStateException: java.lang.reflect.InvocationTargetException in com/zerocracy/stk/pmo/awards/update_reputation.groovy
        at com.zerocracy.farm.reactive.StkGroovy.process(StkGroovy.java:125)
        at com.zerocracy.farm.StkSafe.process(StkSafe.java:81)
        ... 32 more
Caused by: java.lang.reflect.InvocationTargetException
        at sun.reflect.GeneratedMethodAccessor108.invoke(Unknown Source)
        at sun.reflect.DelegatingMethodAccessorImpl.invoke(DelegatingMethodAccessorImpl.java:43)
        at java.lang.reflect.Method.invoke(Method.java:498)
        at com.zerocracy.farm.reactive.StkGroovy.process(StkGroovy.java:115)
        ... 33 more
Caused by: java.lang.IllegalArgumentException: Person @yegor256[/z](https://www.0crat.com/u/yegor256) doesn't exist
        at com.zerocracy.pmo.People.reputation(People.java:656)
        at com.zerocracy.pmo.People$reputation$7.call(Unknown Source)
        at com.zerocracy.stk.pmo.awards.update_reputation.exec(update_reputation.groovy:34)
        ... 37 more

swallowed runtime exception: java.lang.IllegalStateException: java.lang.IllegalStateException: java.lang.reflect.InvocationTargetException in com/zerocracy/stk/pm/comm/notify_job.groovy
        at com.zerocracy.farm.StkSafe.process(StkSafe.java:115)
        at com.zerocracy.farm.reactive.StkSmart.process(StkSmart.java:66)
        at com.zerocracy.farm.reactive.Brigade.process(Brigade.java:82)
        at com.zerocracy.farm.reactive.Brigade.lambda$apply$0(Brigade.java:64)
        at org.cactoos.func.UncheckedFunc.lambda$apply$0(UncheckedFunc.java:58)
        at org.cactoos.scalar.IoCheckedScalar.value(IoCheckedScalar.java:70)
        at org.cactoos.scalar.UncheckedScalar.value(UncheckedScalar.java:58)
        at org.cactoos.func.UncheckedFunc.apply(UncheckedFunc.java:59)
        at org.cactoos.iterator.Filtered.hasNext(Filtered.java:90)
        at org.cactoos.iterator.LengthOf.lambda$new$0(LengthOf.java:52)
        at org.cactoos.scalar.IoCheckedScalar.value(IoCheckedScalar.java:70)
        at org.cactoos.scalar.UncheckedScalar.value(UncheckedScalar.java:58)
        at org.cactoos.scalar.NumberEnvelope.doubleValue(NumberEnvelope.java:113)
        at org.cactoos.iterable.LengthOf.lambda$new$0(LengthOf.java:51)
        at org.cactoos.scalar.NumberEnvelope.lambda$new$1(NumberEnvelope.java:73)
        at org.cactoos.scalar.IoCheckedScalar.value(IoCheckedScalar.java:70)
        at org.cactoos.scalar.UncheckedScalar.value(UncheckedScalar.java:58)
        at org.cactoos.scalar.NumberEnvelope.intValue(NumberEnvelope.java:98)
        at com.zerocracy.farm.reactive.Brigade.apply(Brigade.java:67)
        at com.zerocracy.farm.reactive.Brigade.apply(Brigade.java:37)
        at org.cactoos.func.IoCheckedBiFunc.lambda$apply$0(IoCheckedBiFunc.java:60)
        at org.cactoos.scalar.IoCheckedScalar.value(IoCheckedScalar.java:70)
        at org.cactoos.func.IoCheckedBiFunc.apply(IoCheckedBiFunc.java:61)
        at com.zerocracy.farm.reactive.DefaultFlush.process(DefaultFlush.java:97)
        at com.zerocracy.farm.reactive.DefaultFlush.exec(DefaultFlush.java:70)
        at com.zerocracy.farm.reactive.DefaultFlush.exec(DefaultFlush.java:44)
        at com.zerocracy.farm.reactive.AsyncFlush.lambda$exec$2(AsyncFlush.java:118)
        at com.jcabi.log.VerboseCallable.call(VerboseCallable.java:173)
        at java.util.concurrent.FutureTask.run(FutureTask.java:266)
        at java.util.concurrent.ThreadPoolExecutor.runWorker(ThreadPoolExecutor.java:1142)
        at java.util.concurrent.ThreadPoolExecutor$Worker.run(ThreadPoolExecutor.java:617)
        at com.jcabi.log.VerboseThreads$Wrap.run(VerboseThreads.java:221)
        at java.lang.Thread.run(Thread.java:745)
Caused by: java.lang.IllegalStateException: java.lang.reflect.InvocationTargetException in com/zerocracy/stk/pm/comm/notify_job.groovy
        at com.zerocracy.farm.reactive.StkGroovy.process(StkGroovy.java:125)
        at com.zerocracy.farm.StkSafe.process(StkSafe.java:81)
        ... 32 more
Caused by: java.lang.reflect.InvocationTargetException
        at sun.reflect.GeneratedMethodAccessor124.invoke(Unknown Source)
        at sun.reflect.DelegatingMethodAccessorImpl.invoke(DelegatingMethodAccessorImpl.java:43)
        at java.lang.reflect.Method.invoke(Method.java:498)
        at com.zerocracy.farm.reactive.StkGroovy.process(StkGroovy.java:115)
        ... 33 more
Caused by: java.lang.IllegalStateException: I don't know how to notify job "none"
        at sun.reflect.NativeConstructorAccessorImpl.newInstance0(Native Method)
        at sun.reflect.NativeConstructorAccessorImpl.newInstance(NativeConstructorAccessorImpl.java:62)
        at sun.reflect.DelegatingConstructorAccessorImpl.newInstance(DelegatingConstructorAccessorImpl.java:45)
        at java.lang.reflect.Constructor.newInstance(Constructor.java:423)
        at org.codehaus.groovy.reflection.CachedConstructor.invoke(CachedConstructor.java:77)
        at org.codehaus.groovy.runtime.callsite.ConstructorSite$ConstructorSiteNoUnwrapNoCoerce.callConstructor(ConstructorSite.java:102)
        at org.codehaus.groovy.runtime.callsite.AbstractCallSite.callConstructor(AbstractCallSite.java:190)
        at com.zerocracy.stk.pm.comm.notify_job.exec(notify_job.groovy:51)
        ... 37 more

swallowed runtime exception: java.lang.IllegalStateException: java.lang.IllegalStateException: java.lang.reflect.InvocationTargetException in com/zerocracy/stk/pmo/awards/update_reputation.groovy
        at com.zerocracy.farm.StkSafe.process(StkSafe.java:115)
        at com.zerocracy.farm.reactive.StkSmart.process(StkSmart.java:66)
        at com.zerocracy.farm.reactive.Brigade.process(Brigade.java:82)
        at com.zerocracy.farm.reactive.Brigade.lambda$apply$0(Brigade.java:64)
        at org.cactoos.func.UncheckedFunc.lambda$apply$0(UncheckedFunc.java:58)
        at org.cactoos.scalar.IoCheckedScalar.value(IoCheckedScalar.java:70)
        at org.cactoos.scalar.UncheckedScalar.value(UncheckedScalar.java:58)
        at org.cactoos.func.UncheckedFunc.apply(UncheckedFunc.java:59)
        at org.cactoos.iterator.Filtered.hasNext(Filtered.java:90)
        at org.cactoos.iterator.LengthOf.lambda$new$0(LengthOf.java:52)
        at org.cactoos.scalar.IoCheckedScalar.value(IoCheckedScalar.java:70)
        at org.cactoos.scalar.UncheckedScalar.value(UncheckedScalar.java:58)
        at org.cactoos.scalar.NumberEnvelope.doubleValue(NumberEnvelope.java:113)
        at org.cactoos.iterable.LengthOf.lambda$new$0(LengthOf.java:51)
        at org.cactoos.scalar.NumberEnvelope.lambda$new$1(NumberEnvelope.java:73)
        at org.cactoos.scalar.IoCheckedScalar.value(IoCheckedScalar.java:70)
        at org.cactoos.scalar.UncheckedScalar.value(UncheckedScalar.java:58)
        at org.cactoos.scalar.NumberEnvelope.intValue(NumberEnvelope.java:98)
        at com.zerocracy.farm.reactive.Brigade.apply(Brigade.java:67)
        at com.zerocracy.farm.reactive.Brigade.apply(Brigade.java:37)
        at org.cactoos.func.IoCheckedBiFunc.lambda$apply$0(IoCheckedBiFunc.java:60)
        at org.cactoos.scalar.IoCheckedScalar.value(IoCheckedScalar.java:70)
        at org.cactoos.func.IoCheckedBiFunc.apply(IoCheckedBiFunc.java:61)
        at com.zerocracy.farm.reactive.DefaultFlush.process(DefaultFlush.java:97)
        at com.zerocracy.farm.reactive.DefaultFlush.exec(DefaultFlush.java:70)
        at com.zerocracy.farm.reactive.DefaultFlush.exec(DefaultFlush.java:44)
        at com.zerocracy.farm.reactive.AsyncFlush.lambda$exec$2(AsyncFlush.java:118)
        at com.jcabi.log.VerboseCallable.call(VerboseCallable.java:173)
        at java.util.concurrent.FutureTask.run(FutureTask.java:266)
        at java.util.concurrent.ThreadPoolExecutor.runWorker(ThreadPoolExecutor.java:1142)
        at java.util.concurrent.ThreadPoolExecutor$Worker.run(ThreadPoolExecutor.java:617)
        at com.jcabi.log.VerboseThreads$Wrap.run(VerboseThreads.java:221)
        at java.lang.Thread.run(Thread.java:745)
Caused by: java.lang.IllegalStateException: java.lang.reflect.InvocationTargetException in com/zerocracy/stk/pmo/awards/update_reputation.groovy
        at com.zerocracy.farm.reactive.StkGroovy.process(StkGroovy.java:125)
        at com.zerocracy.farm.StkSafe.process(StkSafe.java:81)
        ... 32 more
Caused by: java.lang.reflect.InvocationTargetException
        at sun.reflect.GeneratedMethodAccessor108.invoke(Unknown Source)
        at sun.reflect.DelegatingMethodAccessorImpl.invoke(DelegatingMethodAccessorImpl.java:43)
        at java.lang.reflect.Method.invoke(Method.java:498)
        at com.zerocracy.farm.reactive.StkGroovy.process(StkGroovy.java:115)
        ... 33 more
Caused by: java.lang.IllegalArgumentException: Person @yegor256[/z](https://www.0crat.com/u/yegor256) doesn't exist
        at com.zerocracy.pmo.People.reputation(People.java:656)
        at com.zerocracy.pmo.People$reputation$7.call(Unknown Source)
        at com.zerocracy.stk.pmo.awards.update_reputation.exec(update_reputation.groovy:34)
        ... 37 more

Tests run: 47, Failures: 0, Errors: 0, Skipped: 0, Time elapsed: 87.581 sec - in [com/zerocracy/bundles/zerocrat_assignment_adds_to_wbs]
Running com.zerocracy.tk.TkIndexTest
Tests run: 1, Failures: 0, Errors: 0, Skipped: 0, Time elapsed: 0.072 sec - in com.zerocracy.tk.TkIndexTest
Running com.zerocracy.tk.project.RqProjectTest
Tests run: 2, Failures: 0, Errors: 0, Skipped: 0, Time elapsed: 0.916 sec - in com.zerocracy.tk.project.RqProjectTest
Running com.zerocracy.radars.github.RbOnBugTest
Tests run: 1, Failures: 0, Errors: 0, Skipped: 0, Time elapsed: 0.386 sec - in com.zerocracy.radars.github.RbOnBugTest
Running com.zerocracy.cash.QuotesTest
Tests run: 1, Failures: 0, Errors: 0, Skipped: 0, Time elapsed: 0.001 sec - in com.zerocracy.cash.QuotesTest
Running com.zerocracy.pm.in.JobExpiredTest
Tests run: 2, Failures: 0, Errors: 0, Skipped: 0, Time elapsed: 0.406 sec - in com.zerocracy.pm.in.JobExpiredTest
Running com.zerocracy.farm.reactive.AsyncFlushTest
Tests run: 1, Failures: 0, Errors: 0, Skipped: 0, Time elapsed: 7.053 sec - in com.zerocracy.farm.reactive.AsyncFlushTest
Running com.zerocracy.tk.TkAppTest
Tests run: 2, Failures: 0, Errors: 0, Skipped: 0, Time elapsed: 2.293 sec - in com.zerocracy.tk.TkAppTest
Running com.zerocracy.farm.SmartFarmTest
swallowed exception: java.lang.IllegalStateException('http://datum.zerocracy.com/latest/rules/pm/no-lost-orders.xsl says: The order for job "gh:test/test#22" exists in orders.xml, but the job is absent in the WBS among 0 jobs.')
Tests run: 6, Failures: 0, Errors: 0, Skipped: 0, Time elapsed: 18.698 sec - in com.zerocracy.farm.SmartFarmTest
Running com.zerocracy.entry.PingsTest
Tests run: 1, Failures: 0, Errors: 0, Skipped: 0, Time elapsed: 0.276 sec - in com.zerocracy.entry.PingsTest
Running [/add_to_slack]
Tests run: 10, Failures: 0, Errors: 0, Skipped: 0, Time elapsed: 3.235 sec - in [/add_to_slack]
Running com.zerocracy.tk.profile.TkIdentifyTest
Tests run: 1, Failures: 0, Errors: 0, Skipped: 0, Time elapsed: 0.371 sec - in com.zerocracy.tk.profile.TkIdentifyTest
Running com.zerocracy.pm.ClaimOutTest
#error(): Claim param name "author" is prohibited to use in "Hello dude", since it will clash with other claim attributes
#fatalError(): Processing terminated by xsl:message at line 26 in file:///; SystemID: file:///; Line#: 26; Column#: 5
#error(): Duplicated flow detected, something is wrong: "Hey; Hey; Hey", seems to be an endless recursion in claims
#fatalError(): Processing terminated by xsl:message at line 28 in file:///; SystemID: file:///; Line#: 28
#error(): Claim cause "some text while a number expected" is not valid number
#fatalError(): Processing terminated by xsl:message at line 26 in file:///; SystemID: file:///; Line#: 26; Column#: 6
#error(): Job name "this is not a job" is not valid
#fatalError(): Processing terminated by xsl:message at line 27 in file:///; SystemID: file:///; Line#: 27; Column#: 6
#error(): Role name "this is not a role" is not valid
#fatalError(): Processing terminated by xsl:message at line 27 in file:///; SystemID: file:///; Line#: 27; Column#: 6
Tests run: 3, Failures: 0, Errors: 0, Skipped: 0, Time elapsed: 1.013 sec - in com.zerocracy.pm.ClaimOutTest
Running com.zerocracy.radars.github.RbMilestoneTest
Tests run: 1, Failures: 0, Errors: 0, Skipped: 0, Time elapsed: 0.019 sec - in com.zerocracy.radars.github.RbMilestoneTest
Running com.zerocracy.tools.SignatureTest
Tests run: 1, Failures: 0, Errors: 0, Skipped: 1, Time elapsed: 0 sec - in com.zerocracy.tools.SignatureTest

Results :

Tests run: 324, Failures: 0, Errors: 0, Skipped: 5

[ERROR] Failed to execute goal org.jacoco:jacoco-maven-plugin:0.8.0:check (jacoco-check) on project farm: Coverage checks have not been met. See log for details. -> [Help 1]
org.apache.maven.lifecycle.LifecycleExecutionException: Failed to execute goal org.jacoco:jacoco-maven-plugin:0.8.0:check (jacoco-check) on project farm: Coverage checks have not been met. See log for details.
        at org.apache.maven.lifecycle.internal.MojoExecutor.execute(MojoExecutor.java:212)
        at org.apache.maven.lifecycle.internal.MojoExecutor.execute(MojoExecutor.java:153)
        at org.apache.maven.lifecycle.internal.MojoExecutor.execute(MojoExecutor.java:145)
        at org.apache.maven.lifecycle.internal.LifecycleModuleBuilder.buildProject(LifecycleModuleBuilder.java:116)
        at org.apache.maven.lifecycle.internal.LifecycleModuleBuilder.buildProject(LifecycleModuleBuilder.java:80)
        at org.apache.maven.lifecycle.internal.builder.singlethreaded.SingleThreadedBuilder.build(SingleThreadedBuilder.java:51)
        at org.apache.maven.lifecycle.internal.LifecycleStarter.execute(LifecycleStarter.java:128)
        at org.apache.maven.DefaultMaven.doExecute(DefaultMaven.java:307)
        at org.apache.maven.DefaultMaven.doExecute(DefaultMaven.java:193)
        at org.apache.maven.DefaultMaven.execute(DefaultMaven.java:106)
        at org.apache.maven.cli.MavenCli.execute(MavenCli.java:863)
        at org.apache.maven.cli.MavenCli.doMain(MavenCli.java:288)
        at org.apache.maven.cli.MavenCli.main(MavenCli.java:199)
        at sun.reflect.NativeMethodAccessorImpl.invoke0(Native Method)
        at sun.reflect.NativeMethodAccessorImpl.invoke(NativeMethodAccessorImpl.java:62)
        at sun.reflect.DelegatingMethodAccessorImpl.invoke(DelegatingMethodAccessorImpl.java:43)
        at java.lang.reflect.Method.invoke(Method.java:498)
        at org.codehaus.plexus.classworlds.launcher.Launcher.launchEnhanced(Launcher.java:289)
        at org.codehaus.plexus.classworlds.launcher.Launcher.launch(Launcher.java:229)
        at org.codehaus.plexus.classworlds.launcher.Launcher.mainWithExitCode(Launcher.java:415)
        at org.codehaus.plexus.classworlds.launcher.Launcher.main(Launcher.java:356)
Caused by: org.apache.maven.plugin.MojoExecutionException: Coverage checks have not been met. See log for details.
        at org.jacoco.maven.CheckMojo.executeCheck(CheckMojo.java:187)
        at org.jacoco.maven.CheckMojo.executeMojo(CheckMojo.java:161)
        at org.jacoco.maven.AbstractJacocoMojo.execute(AbstractJacocoMojo.java:63)
        at org.apache.maven.plugin.DefaultBuildPluginManager.executeMojo(DefaultBuildPluginManager.java:134)
        at org.apache.maven.lifecycle.internal.MojoExecutor.execute(MojoExecutor.java:207)
        ... 20 more
[ERROR]
[ERROR] Re-run Maven using the -X switch to enable full debug logging.
[ERROR]
[ERROR] For more information about the errors and possible solutions, please read the following articles:
[ERROR] [Help 1] http://cwiki.apache.org/confluence/display/MAVEN/MojoExecutionException
container fd5f3c43af3dab4437ad6a721719685b9706f419c8ae46599a299687bdc247de is dead
Wed Apr 11 08:53:14 CEST 2018