rultor.com logo This build log was produced by rultor.com for zerocracy/farm#1464
+ set -e
+ set -o pipefail
++ dirname ./run.sh
+ cd .
+ echo 22978
+ echo '1.67.4 dbdae7b78'
1.67.4 dbdae7b78
+ date
Fri Aug  3 14:51:16 CEST 2018
+ uptime
 14:51:16 up 26 days, 23:35,  0 users,  load average: 5.16, 5.28, 5.55
+ head=git@github.com:zerocracy/farm.git
+ ff=default
+ image=yegor256/java8
+ rebase=false
+ squash=false
+ head_branch=master
+ author=g4s8
+ tag=0.28.15
+ vars=('--env=MAVEN_OPTS=-Xmx1g' '--env=head=git@github.com:zerocracy/farm.git' '--env=tag=0.28.15' '--env=scripts=( '\''export '\''\'\'''\''MAVEN_OPTS=-Xmx1g'\''\'\'''\'''\'' '\'';'\'' '\''export '\''\'\'''\''head=git@github.com:zerocracy/farm.git'\''\'\'''\'''\'' '\'';'\'' '\''export '\''\'\'''\''tag=0.28.15'\''\'\'''\'''\'' '\'';'\'' '\''export '\''\'\'''\''head_branch=master'\''\'\'''\'''\'' '\'';'\'' '\''export '\''\'\'''\''author=g4s8'\''\'\'''\'''\'' '\'';'\'' '\''sudo apt-key adv --keyserver hkp://keyserver.ubuntu.com:80 --recv 0C49F3730359A14518585931BC711F9BA15703C6'\'' '\'';'\'' '\''echo "deb [ arch=amd64 ] http://repo.mongodb.org/apt/ubuntu trusty/mongodb-org/3.4 multiverse" | sudo tee /etc/apt/sources.list.d/mongodb-org-3.4.list'\'' '\'';'\'' '\''sudo apt-get update'\'' '\'';'\'' '\''sudo apt-get install -y mongodb-org'\'' '\'';'\'' '\''sudo gem install pdd'\'' '\'';'\'' '\''sudo gem install xcop'\'' '\'';'\'' '\''sudo gem install sass -v 3.4.25'\'' '\'';'\'' '\''java -version'\'' '\'';'\'' '\''[[ "${tag}" =~ ^[0-9]+(\.[0-9]+)*$ ]] || exit -1'\'' '\'';'\'' '\''mvn clean process-resources --quiet'\'' '\'';'\'' '\''mvn clean versions:set "-DnewVersion=${tag}" --quiet'\'' '\'';'\'' '\''git commit -am "${tag}"'\'' '\'';'\'' '\''cp ../settings.xml settings.xml'\'' '\'';'\'' '\''mvn clean package -Pqulice,codenarc,zc-farm --errors --batch-mode --quiet --settings ../settings.xml'\'' '\'';'\'' '\''git remote add heroku git@heroku.com:zerocrat.git'\'' '\'';'\'' '\''mkdir ~/.ssh'\'' '\'';'\'' '\''mv ../id_rsa ../id_rsa.pub ~/.ssh'\'' '\'';'\'' '\''chmod -R 600 ~/.ssh/*'\'' '\'';'\'' '\''echo -e "Host *\n  StrictHostKeyChecking no\n  UserKnownHostsFile=/dev/null" > ~/.ssh/config'\'' '\'';'\'' '\''git fetch'\'' '\'';'\'' '\''git add settings.xml'\'' '\'';'\'' '\''mvn initialize -Pshutdown --settings ../settings.xml'\'' '\'';'\'' '\''git commit -m '\''\'\'''\''settings.xml'\''\'\'''\'' && git push -f heroku $(git symbolic-ref --short HEAD):master && git reset HEAD~1'\'' '\'';'\'' '\''curl -f --connect-timeout 15 --retry 5 --retry-delay 30 https://www.0crat.com > /dev/null'\'' '\'';'\'' )' '--env=head_branch=master' '--env=author=g4s8')
+ scripts=('export '\''MAVEN_OPTS=-Xmx1g'\''' ';' 'export '\''head=git@github.com:zerocracy/farm.git'\''' ';' 'export '\''tag=0.28.15'\''' ';' 'export '\''head_branch=master'\''' ';' 'export '\''author=g4s8'\''' ';' 'sudo apt-key adv --keyserver hkp://keyserver.ubuntu.com:80 --recv 0C49F3730359A14518585931BC711F9BA15703C6' ';' 'echo "deb [ arch=amd64 ] http://repo.mongodb.org/apt/ubuntu trusty/mongodb-org/3.4 multiverse" | sudo tee /etc/apt/sources.list.d/mongodb-org-3.4.list' ';' 'sudo apt-get update' ';' 'sudo apt-get install -y mongodb-org' ';' 'sudo gem install pdd' ';' 'sudo gem install xcop' ';' 'sudo gem install sass -v 3.4.25' ';' 'java -version' ';' '[[ "${tag}" =~ ^[0-9]+(\.[0-9]+)*$ ]] || exit -1' ';' 'mvn clean process-resources --quiet' ';' 'mvn clean versions:set "-DnewVersion=${tag}" --quiet' ';' 'git commit -am "${tag}"' ';' 'cp ../settings.xml settings.xml' ';' 'mvn clean package -Pqulice,codenarc,zc-farm --errors --batch-mode --quiet --settings ../settings.xml' ';' 'git remote add heroku git@heroku.com:zerocrat.git' ';' 'mkdir ~/.ssh' ';' 'mv ../id_rsa ../id_rsa.pub ~/.ssh' ';' 'chmod -R 600 ~/.ssh/*' ';' 'echo -e "Host *\n  StrictHostKeyChecking no\n  UserKnownHostsFile=/dev/null" > ~/.ssh/config' ';' 'git fetch' ';' 'git add settings.xml' ';' 'mvn initialize -Pshutdown --settings ../settings.xml' ';' 'git commit -m '\''settings.xml'\'' && git push -f heroku $(git symbolic-ref --short HEAD):master && git reset HEAD~1' ';' 'curl -f --connect-timeout 15 --retry 5 --retry-delay 30 https://www.0crat.com > /dev/null' ';')
+ directory=
+ container=zerocracy_farm_1464
+ as_root=false
+ mkdir -p /home/rultor/.ssh
+ echo -e 'Host github.com\n\tStrictHostKeyChecking no\n'
+ chmod 600 /home/rultor/.ssh/config
+ git clone git@github.com:zerocracy/farm.git repo
Cloning into 'repo'...
+ cd repo
+ git config user.email me@rultor.com
+ git config user.name rultor
+ '[' -z 'export '\''MAVEN_OPTS=-Xmx1g'\''' ']'
+ cd ..
+ cat
+ '[' false = true ']'
+ cat
+ chmod a+x entry.sh
+ cat
+ echo 'export '\''MAVEN_OPTS=-Xmx1g'\''' ';' 'export '\''head=git@github.com:zerocracy/farm.git'\''' ';' 'export '\''tag=0.28.15'\''' ';' 'export '\''head_branch=master'\''' ';' 'export '\''author=g4s8'\''' ';' 'sudo apt-key adv --keyserver hkp://keyserver.ubuntu.com:80 --recv 0C49F3730359A14518585931BC711F9BA15703C6' ';' 'echo "deb [ arch=amd64 ] http://repo.mongodb.org/apt/ubuntu trusty/mongodb-org/3.4 multiverse" | sudo tee /etc/apt/sources.list.d/mongodb-org-3.4.list' ';' 'sudo apt-get update' ';' 'sudo apt-get install -y mongodb-org' ';' 'sudo gem install pdd' ';' 'sudo gem install xcop' ';' 'sudo gem install sass -v 3.4.25' ';' 'java -version' ';' '[[ "${tag}" =~ ^[0-9]+(\.[0-9]+)*$ ]] || exit -1' ';' 'mvn clean process-resources --quiet' ';' 'mvn clean versions:set "-DnewVersion=${tag}" --quiet' ';' 'git commit -am "${tag}"' ';' 'cp ../settings.xml settings.xml' ';' 'mvn clean package -Pqulice,codenarc,zc-farm --errors --batch-mode --quiet --settings ../settings.xml' ';' 'git remote add heroku git@heroku.com:zerocrat.git' ';' 'mkdir ~/.ssh' ';' 'mv ../id_rsa ../id_rsa.pub ~/.ssh' ';' 'chmod -R 600 ~/.ssh/*' ';' 'echo -e "Host *\n  StrictHostKeyChecking no\n  UserKnownHostsFile=/dev/null" > ~/.ssh/config' ';' 'git fetch' ';' 'git add settings.xml' ';' 'mvn initialize -Pshutdown --settings ../settings.xml' ';' 'git commit -m '\''settings.xml'\'' && git push -f heroku $(git symbolic-ref --short HEAD):master && git reset HEAD~1' ';' 'curl -f --connect-timeout 15 --retry 5 --retry-delay 30 https://www.0crat.com > /dev/null' ';'
+ rm -rf .gpg
+ '[' -z 0.28.15 ']'
+ [[ 0.28.15 =~ ^[a-zA-Z0-9\.\-]+$ ]]
+ echo 'tag name is valid: "0.28.15"'
tag name is valid: "0.28.15"
+ cd repo
++ git tag -l 0.28.15
+ '[' ']'
+ export BRANCH_NAME=__rultor
+ BRANCH_NAME=__rultor
++ git show-branch __rultor
++ wc -l
+ '[' 0 -gt 0 ']'
+ git checkout -b __rultor
Switched to a new branch '__rultor'
+ docker_when_possible
+ true
++ uptime
++ sed 's/ /\n/g'
++ tail -n 1
+ load=5.55
++ echo 5.55 '>' 30
++ bc
+ '[' 0 -eq 1 ']'
+ echo 'load average is 5.55, low enough to run a new Docker container'
load average is 5.55, low enough to run a new Docker container
+ break
+ cd ..
+ '[' -n '' ']'
+ use_image=yegor256/java8
+ docker pull yegor256/java8
Using default tag: latest
latest: Pulling from yegor256/java8
Digest: sha256:fc3b52526d557cc92fb73c755b863fc37d3022ffcd296b2781bba35142a4ef13
Status: Image is up to date for yegor256/java8:latest
+ docker ps --filter=status=exited
+ grep --quiet '\szerocracy_farm_1464\s*$'
+ ls -al .
total 76
drwx--x--x  3 rultor rultor  4096 Aug  3 14:51 .
drwxrwxrwt 11 root   root   20480 Aug  3 14:51 ..
-rw-rw-r--  1 rultor rultor   444 Aug  3 14:51 end.sh
-rwxrwxr-x  1 rultor rultor   338 Aug  3 14:51 entry.sh
-rw-rw-r--  1 rultor rultor  1679 Aug  3 14:51 id_rsa
-rw-rw-r--  1 rultor rultor   396 Aug  3 14:51 id_rsa.pub
-rw-rw-r--  1 rultor rultor     6 Aug  3 14:51 pid
drwxrwxr-x  7 rultor rultor  4096 Aug  3 14:51 repo
-rwxrwxr-x  1 rultor rultor  7784 Aug  3 14:51 run.sh
-rw-rw-r--  1 rultor rultor  1519 Aug  3 14:51 script.sh
-rw-rw-r--  1 rultor rultor  6168 Aug  3 14:51 settings.xml
-rw-rw-r--  1 rultor rultor  7120 Aug  3 14:51 stdout
++ pwd
++ pwd
+ docker run -t --rm -v /tmp/rultor-GXCU:/main --env=MAVEN_OPTS=-Xmx1g --env=head=git@github.com:zerocracy/farm.git --env=tag=0.28.15 '--env=scripts=( '\''export '\''\'\'''\''MAVEN_OPTS=-Xmx1g'\''\'\'''\'''\'' '\'';'\'' '\''export '\''\'\'''\''head=git@github.com:zerocracy/farm.git'\''\'\'''\'''\'' '\'';'\'' '\''export '\''\'\'''\''tag=0.28.15'\''\'\'''\'''\'' '\'';'\'' '\''export '\''\'\'''\''head_branch=master'\''\'\'''\'''\'' '\'';'\'' '\''export '\''\'\'''\''author=g4s8'\''\'\'''\'''\'' '\'';'\'' '\''sudo apt-key adv --keyserver hkp://keyserver.ubuntu.com:80 --recv 0C49F3730359A14518585931BC711F9BA15703C6'\'' '\'';'\'' '\''echo "deb [ arch=amd64 ] http://repo.mongodb.org/apt/ubuntu trusty/mongodb-org/3.4 multiverse" | sudo tee /etc/apt/sources.list.d/mongodb-org-3.4.list'\'' '\'';'\'' '\''sudo apt-get update'\'' '\'';'\'' '\''sudo apt-get install -y mongodb-org'\'' '\'';'\'' '\''sudo gem install pdd'\'' '\'';'\'' '\''sudo gem install xcop'\'' '\'';'\'' '\''sudo gem install sass -v 3.4.25'\'' '\'';'\'' '\''java -version'\'' '\'';'\'' '\''[[ "${tag}" =~ ^[0-9]+(\.[0-9]+)*$ ]] || exit -1'\'' '\'';'\'' '\''mvn clean process-resources --quiet'\'' '\'';'\'' '\''mvn clean versions:set "-DnewVersion=${tag}" --quiet'\'' '\'';'\'' '\''git commit -am "${tag}"'\'' '\'';'\'' '\''cp ../settings.xml settings.xml'\'' '\'';'\'' '\''mvn clean package -Pqulice,codenarc,zc-farm --errors --batch-mode --quiet --settings ../settings.xml'\'' '\'';'\'' '\''git remote add heroku git@heroku.com:zerocrat.git'\'' '\'';'\'' '\''mkdir ~/.ssh'\'' '\'';'\'' '\''mv ../id_rsa ../id_rsa.pub ~/.ssh'\'' '\'';'\'' '\''chmod -R 600 ~/.ssh/*'\'' '\'';'\'' '\''echo -e "Host *\n  StrictHostKeyChecking no\n  UserKnownHostsFile=/dev/null" > ~/.ssh/config'\'' '\'';'\'' '\''git fetch'\'' '\'';'\'' '\''git add settings.xml'\'' '\'';'\'' '\''mvn initialize -Pshutdown --settings ../settings.xml'\'' '\'';'\'' '\''git commit -m '\''\'\'''\''settings.xml'\''\'\'''\'' && git push -f heroku $(git symbolic-ref --short HEAD):master && git reset HEAD~1'\'' '\'';'\'' '\''curl -f --connect-timeout 15 --retry 5 --retry-delay 30 https://www.0crat.com > /dev/null'\'' '\'';'\'' )' --env=head_branch=master --env=author=g4s8 --hostname=docker --privileged --memory=6g --memory-swap=16g --oom-kill-disable --cidfile=/tmp/rultor-GXCU/cid -w=/main -v /var/run/docker.sock:/var/run/docker.sock --name=zerocracy_farm_1464 yegor256/java8 /main/entry.sh
WARNING: Your kernel does not support swap limit capabilities or the cgroup is not mounted. Memory limited without swap.
+ set -e
+ set -o pipefail
+ shopt -s dotglob
+ useradd -m -G sudo r
+ echo '%sudo ALL=(ALL) NOPASSWD:ALL'
+ cp -R /root/.bashrc /root/.composer /root/.gem /root/.gnupg /root/.m2 /root/.oracle_jre_usage /root/.profile /root/texmf /home/r
+ cp -R ./cid ./end.sh ./entry.sh ./id_rsa ./id_rsa.pub ./pid ./repo ./run.sh ./script.sh ./settings.xml ./stdout /home/r
+ rm -rf repo
+ chown -R r:r /home/r
+ chmod a+x /home/r/script.sh
+ su --login r --command /home/r/script.sh
+ set -e
+ set -o pipefail
+ shopt -s expand_aliases
+ alias 'sudo=sudo -i'
+ export HOME=/home/r
+ HOME=/home/r
+ cd /home/r/repo
+ export MAVEN_OPTS=-Xmx1g
+ MAVEN_OPTS=-Xmx1g
+ export head=git@github.com:zerocracy/farm.git
+ head=git@github.com:zerocracy/farm.git
+ export tag=0.28.15
+ tag=0.28.15
+ export head_branch=master
+ head_branch=master
+ export author=g4s8
+ author=g4s8
+ sudo -i apt-key adv --keyserver hkp://keyserver.ubuntu.com:80 --recv 0C49F3730359A14518585931BC711F9BA15703C6
Executing: gpg --ignore-time-conflict --no-options --no-default-keyring --homedir /tmp/tmp.dS8J17Uea4 --no-auto-check-trustdb --trust-model always --keyring /etc/apt/trusted.gpg --primary-keyring /etc/apt/trusted.gpg --keyring /etc/apt/trusted.gpg.d/git-core-ppa.gpg --keyserver hkp://keyserver.ubuntu.com:80 --recv 0C49F3730359A14518585931BC711F9BA15703C6
gpg: requesting key A15703C6 from hkp server keyserver.ubuntu.com
gpg: key A15703C6: public key "MongoDB 3.4 Release Signing Key <packaging@mongodb.com>" imported
gpg: Total number processed: 1
gpg:               imported: 1  (RSA: 1)
+ echo 'deb [ arch=amd64 ] http://repo.mongodb.org/apt/ubuntu trusty/mongodb-org/3.4 multiverse'
+ sudo -i tee /etc/apt/sources.list.d/mongodb-org-3.4.list
stdin: is not a tty
deb [ arch=amd64 ] http://repo.mongodb.org/apt/ubuntu trusty/mongodb-org/3.4 multiverse
+ sudo -i apt-get update
Hit[http://ppa.launchpad.net trusty InRelease
Ign[http://archive.ubuntu.comttrustyrInRelease [Waiting for headers]
Get:1 http://archive.ubuntu.com trusty-updates InRelease [65.9 kB]
Hit http://archive.ubuntu.com trusty-backports InRelease
Get:2 http://security.ubuntu.com trusty-security InRelease [65.9 kB]
Get:3 http://ppa.launchpad.net trusty InRelease [15.5 kB]
Ign http://ppa.launchpad.net precise InRelease
Ign http://repo.mongodb.org trusty/mongodb-org/3.4 InRelease
Hit%http://archive.ubuntu.com trusty Release.gpg
Hit%http://archive.ubuntu.com trustycRelease ppa.launchpad.net (91.189.95.83)]
Hit%http://ppa.launchpad.net]precisenRelease.gpgrs] [Waiting for headers]
Hit%https://deb.nodesource.com[trustygInReleaseers]
Get:4[http://repo.mongodb.org trusty/mongodb-org/3.4nRelease.gpg9[8019B]5.83)]
Hit%http://ppa.launchpad.net]precisenReleaseeaders] [4 Release.gpg 801 B/801 B
Get:5[http://repo.mongodb.org trusty/mongodb-org/3.4 Release [2495 B]
Hit%http://ppa.launchpad.netktrusty/main amd64 Packages
Get:6[http://archive.ubuntu.com trusty-updates/universe Sources [256 kB]
Get:7[http://archive.ubuntu.comatrusty-updates/mainaamd64 Packagese[1358 kB]
Get:8[http://archive.ubuntu.comRtrusty-updates/restrictedtamd64oPackagess[21.4 kB]
Get:9[http://archive.ubuntu.comRtrusty-updates/universePamd64ePackages.[597 kB]
Get:107http://archive.ubuntu.cometrusty-updates/multiverseiamd64rPackages][16.0 kB]
Get:117http://security.ubuntu.comltrusty-security/universeiSourcesh[92.1skB] 0%
Hit http://archive.ubuntu.comntrusty-backports/main amd64iPackageseaders] [11 S
Hit%http://archive.ubuntu.cometrusty-backports/restrictedfamd64aPackagesaitingt
Get:12 http://security.ubuntu.com trusty-security/main amd64 Packages [941 kB]
Hit http://archive.ubuntu.comatrusty-backports/universe amd64ePackages12 Packag
Hit http://archive.ubuntu.com trusty-backports/multiverse amd64 Packages
Get:13 http://ppa.launchpad.net trusty/main amd64 Packages [1551 B]
Get:149http://security.ubuntu.comatrusty-security/restricted amd64 Packages [18.1 kB]
Get:15 http://security.ubuntu.com trusty-security/universe amd64 Packages [302 kB]
Get:16 http://security.ubuntu.com trusty-security/multiverse amd64 Packages [4727 B]
Hit%http://archive.ubuntu.comRtrusty/universe4Sourcesitingeforrheaders]]
Hit%http://archive.ubuntu.comRtrusty/main amd64BPackages
Hit%http://archive.ubuntu.com trusty/restricted amd64 Packages
Hit%http://archive.ubuntu.com trusty/universe amd64 Packages
Hit http://archive.ubuntu.com trusty/multiverse amd64 Packages
Hit%https://deb.nodesource.com trusty/main Sources
Hit%https://deb.nodesource.comptrusty/main1amd64.Packagesiting.for.headers][Wai
Hit%http://ppa.launchpad.netoprecise/mainpamd64uPackageset (91.189.95.83)] [Wai
Get:17 http://repo.mongodb.org trusty/mongodb-org/3.4/multiverse amd64 Packages [11.8 kB]
Fetchedo3770gkBein06s](626 kB/s)                                   3519 kB/s 0s
Reading package lists... Done
W: Size of file /var/lib/apt/lists/archive.ubuntu.com_ubuntu_dists_trusty-updates_multiverse_binary-amd64_Packages.gz is not what the server reported 16013 16015
W: Duplicate sources.list entry http://ppa.launchpad.net/git-core/ppa/ubuntu/ trusty/main amd64 Packages (/var/lib/apt/lists/ppa.launchpad.net_git-core_ppa_ubuntu_dists_trusty_main_binary-amd64_Packages.gz)
W: Duplicate sources.list entry http://ppa.launchpad.net/git-core/ppa/ubuntu/ trusty/main amd64 Packages (/var/lib/apt/lists/ppa.launchpad.net_git-core_ppa_ubuntu_dists_trusty_main_binary-amd64_Packages.gz)
W: Duplicate sources.list entry http://ppa.launchpad.net/webupd8team/java/ubuntu/ trusty/main amd64 Packages (/var/lib/apt/lists/ppa.launchpad.net_webupd8team_java_ubuntu_dists_trusty_main_binary-amd64_Packages.gz)
W: Duplicate sources.list entry http://ppa.launchpad.net/natecarlson/maven3/ubuntu/ precise/main amd64 Packages (/var/lib/apt/lists/ppa.launchpad.net_natecarlson_maven3_ubuntu_dists_precise_main_binary-amd64_Packages.gz)
+ sudo -i apt-get install -y mongodb-org
Reading package lists... Done
Building dependency tree... 50%
Reading state information... Done
The following extra packages will be installed:
  mongodb-org-mongos mongodb-org-server mongodb-org-shell mongodb-org-tools
The following NEW packages will be installed:
  mongodb-org mongodb-org-mongos mongodb-org-server mongodb-org-shell
  mongodb-org-tools
0 upgraded, 5 newly installed, 0 to remove and 52 not upgraded.
Need to get 68.0 MB of archives.
After this operation, 271 MB of additional disk space will be used.
Get:1ohttp://repo.mongodb.org/apt/ubuntu/ trusty/mongodb-org/3.4/multiverse mongodb-org-shell amd64 3.4.16 [7991 kB]
Get:2Whttp://repo.mongodb.org/apt/ubuntu/2trusty/mongodb-org/3.4/multiverse mongodb-org-server amd64 3.4.16 [14.3 MB]
Get:3Whttp://repo.mongodb.org/apt/ubuntu/0trusty/mongodb-org/3.4/multiverse mongodb-org-mongos amd64 3.4.16 [8287 kB]
Get:4Whttp://repo.mongodb.org/apt/ubuntu/0trusty/mongodb-org/3.4/multiverse mongodb-org-tools amd64 3.4.16 [37.4 MB]
Get:5[http://repo.mongodb.org/apt/ubuntu/9trusty/mongodb-org/3.4/multiversesmongodb-org amd64 3.4.16 [3518 B]
Fetchedo68.0gMB-ing6s4(10.43MB/s) 70%]                             10.6 MB/s 0s
dpkg-preconfigure: unable to re-open stdin: No such file or directory
Selecting previously unselected package mongodb-org-shell.
(Reading database ... 63242 files and directories currently installed.)
Preparing to unpack .../mongodb-org-shell_3.4.16_amd64.deb ...
Unpacking mongodb-org-shell (3.4.16) ...
Selecting previously unselected package mongodb-org-server.
Preparing to unpack .../mongodb-org-server_3.4.16_amd64.deb ...
Unpacking mongodb-org-server (3.4.16) ...
Selecting previously unselected package mongodb-org-mongos.
Preparing to unpack .../mongodb-org-mongos_3.4.16_amd64.deb ...
Unpacking mongodb-org-mongos (3.4.16) ...
Selecting previously unselected package mongodb-org-tools.
Preparing to unpack .../mongodb-org-tools_3.4.16_amd64.deb ...
Unpacking mongodb-org-tools (3.4.16) ...
Selecting previously unselected package mongodb-org.
Preparing to unpack .../mongodb-org_3.4.16_amd64.deb ...
Unpacking mongodb-org (3.4.16) ...
Processing triggers for man-db (2.6.7.1-1ubuntu1) ...
Processing triggers for ureadahead (0.100.0-16) ...
Setting up mongodb-org-shell (3.4.16) ...
Setting up mongodb-org-server (3.4.16) ...
Adding system user `mongodb' (UID 104) ...
Adding new user `mongodb' (UID 104) with group `nogroup' ...
Not creating home directory `/home/mongodb'.
Adding group `mongodb' (GID 109) ...
Done.
Adding user `mongodb' to group `mongodb' ...
Adding user mongodb to group mongodb
Done.
invoke-rc.d: unknown initscript, /etc/init.d/mongod not found.
invoke-rc.d: policy-rc.d denied execution of start.
Setting up mongodb-org-mongos (3.4.16) ...
Setting up mongodb-org-tools (3.4.16) ...
Processing triggers for ureadahead (0.100.0-16) ...
Setting up mongodb-org (3.4.16) ...
W: Duplicate sources.list entry http://ppa.launchpad.net/git-core/ppa/ubuntu/ trusty/main amd64 Packages (/var/lib/apt/lists/ppa.launchpad.net_git-core_ppa_ubuntu_dists_trusty_main_binary-amd64_Packages.gz)
W: Duplicate sources.list entry http://ppa.launchpad.net/git-core/ppa/ubuntu/ trusty/main amd64 Packages (/var/lib/apt/lists/ppa.launchpad.net_git-core_ppa_ubuntu_dists_trusty_main_binary-amd64_Packages.gz)
W: Duplicate sources.list entry http://ppa.launchpad.net/webupd8team/java/ubuntu/ trusty/main amd64 Packages (/var/lib/apt/lists/ppa.launchpad.net_webupd8team_java_ubuntu_dists_trusty_main_binary-amd64_Packages.gz)
W: Duplicate sources.list entry http://ppa.launchpad.net/natecarlson/maven3/ubuntu/ precise/main amd64 Packages (/var/lib/apt/lists/ppa.launchpad.net_natecarlson_maven3_ubuntu_dists_precise_main_binary-amd64_Packages.gz)
W: You may want to run apt-get update to correct these problems
+ sudo -i gem install pdd
Fetching: mini_portile2-2.3.0.gem (100%)
Successfully installed mini_portile2-2.3.0
Fetching: nokogiri-1.8.2.gem (100%)
Building native extensions.  This could take a while...
Successfully installed nokogiri-1.8.2
Fetching: rainbow-3.0.0.gem (100%)
Successfully installed rainbow-3.0.0
Fetching: slop-4.6.1.gem (100%)
Successfully installed slop-4.6.1
Fetching: pdd-0.20.3.gem (100%)
Successfully installed pdd-0.20.3
Parsing documentation for mini_portile2-2.3.0
Installing ri documentation for mini_portile2-2.3.0
Parsing documentation for nokogiri-1.8.2
Installing ri documentation for nokogiri-1.8.2
Parsing documentation for rainbow-3.0.0
Installing ri documentation for rainbow-3.0.0
Parsing documentation for slop-4.6.1
Installing ri documentation for slop-4.6.1
Parsing documentation for pdd-0.20.3
Installing ri documentation for pdd-0.20.3
Done installing documentation for mini_portile2, nokogiri, rainbow, slop, pdd after 16 seconds
5 gems installed
+ sudo -i gem install xcop
Fetching: differ-0.1.2.gem (100%)
Successfully installed differ-0.1.2
Fetching: xcop-0.6.gem (100%)
Successfully installed xcop-0.6
Parsing documentation for differ-0.1.2
Installing ri documentation for differ-0.1.2
Parsing documentation for xcop-0.6
Installing ri documentation for xcop-0.6
Done installing documentation for differ, xcop after 0 seconds
2 gems installed
+ sudo -i gem install sass -v 3.4.25
Fetching: sass-3.4.25.gem (100%)
Successfully installed sass-3.4.25
Parsing documentation for sass-3.4.25
Installing ri documentation for sass-3.4.25
Done installing documentation for sass after 4 seconds
1 gem installed
+ java -version
java version "1.8.0_171"
Java(TM) SE Runtime Environment (build 1.8.0_171-b11)
Java HotSpot(TM) 64-Bit Server VM (build 25.171-b11, mixed mode)
+ [[ 0.28.15 =~ ^[0-9]+(\.[0-9]+)*$ ]]
+ mvn clean process-resources --quiet
Ignoring bigdecimal-1.3.4 because its extensions are not built. Try: gem pristine bigdecimal --version 1.3.4
Ignoring executable-hooks-1.4.2 because its extensions are not built. Try: gem pristine executable-hooks --version 1.4.2
Ignoring executable-hooks-1.3.2 because its extensions are not built. Try: gem pristine executable-hooks --version 1.3.2
Ignoring ffi-1.9.23 because its extensions are not built. Try: gem pristine ffi --version 1.9.23
Ignoring gem-wrappers-1.4.0 because its extensions are not built. Try: gem pristine gem-wrappers --version 1.4.0
Ignoring gem-wrappers-1.3.2 because its extensions are not built. Try: gem pristine gem-wrappers --version 1.3.2
Ignoring gem-wrappers-1.2.7 because its extensions are not built. Try: gem pristine gem-wrappers --version 1.2.7
Ignoring io-console-0.4.6 because its extensions are not built. Try: gem pristine io-console --version 0.4.6
Ignoring json-2.1.0 because its extensions are not built. Try: gem pristine json --version 2.1.0
Ignoring nokogiri-1.8.2 because its extensions are not built. Try: gem pristine nokogiri --version 1.8.2
Ignoring nokogiri-1.6.7.2 because its extensions are not built. Try: gem pristine nokogiri --version 1.6.7.2
Ignoring psych-3.0.2 because its extensions are not built. Try: gem pristine psych --version 3.0.2
+ mvn clean versions:set -DnewVersion=0.28.15 --quiet
Props: {project.groupId=com.zerocracy, project.parent.version=0.49.2, project.parent.artifactId=parent, project.artifactId=farm, project.version=0.28.15, project.parent.groupId=com.jcabi}
+ git commit -am 0.28.15
[__rultor f34eeb7c] 0.28.15
 1 file changed, 1 insertion(+), 1 deletion(-)
+ cp ../settings.xml settings.xml
+ mvn clean package -Pqulice,codenarc,zc-farm --errors --batch-mode --quiet --settings ../settings.xml
Ignoring bigdecimal-1.3.4 because its extensions are not built. Try: gem pristine bigdecimal --version 1.3.4
Ignoring executable-hooks-1.4.2 because its extensions are not built. Try: gem pristine executable-hooks --version 1.4.2
Ignoring executable-hooks-1.3.2 because its extensions are not built. Try: gem pristine executable-hooks --version 1.3.2
Ignoring ffi-1.9.23 because its extensions are not built. Try: gem pristine ffi --version 1.9.23
Ignoring gem-wrappers-1.4.0 because its extensions are not built. Try: gem pristine gem-wrappers --version 1.4.0
Ignoring gem-wrappers-1.3.2 because its extensions are not built. Try: gem pristine gem-wrappers --version 1.3.2
Ignoring gem-wrappers-1.2.7 because its extensions are not built. Try: gem pristine gem-wrappers --version 1.2.7
Ignoring io-console-0.4.6 because its extensions are not built. Try: gem pristine io-console --version 0.4.6
Ignoring json-2.1.0 because its extensions are not built. Try: gem pristine json --version 2.1.0
Ignoring nokogiri-1.8.2 because its extensions are not built. Try: gem pristine nokogiri --version 1.8.2
Ignoring nokogiri-1.6.7.2 because its extensions are not built. Try: gem pristine nokogiri --version 1.6.7.2
Ignoring psych-3.0.2 because its extensions are not built. Try: gem pristine psych --version 3.0.2

-------------------------------------------------------
 T E S T S
-------------------------------------------------------
Running com.zerocracy.farm.fake.FkItemTest
Tests run: 4, Failures: 0, Errors: 0, Skipped: 0, Time elapsed: 0.169 sec - in com.zerocracy.farm.fake.FkItemTest
Running com.zerocracy.radars.github.ReIfAddressedTest
Tests run: 3, Failures: 0, Errors: 0, Skipped: 0, Time elapsed: 2.317 sec - in com.zerocracy.radars.github.ReIfAddressedTest
Running com.zerocracy.farm.S3ItemTest
Tests run: 5, Failures: 0, Errors: 0, Skipped: 0, Time elapsed: 3.334 sec - in com.zerocracy.farm.S3ItemTest
Running com.zerocracy.pm.time.NegligenceTest
Tests run: 3, Failures: 0, Errors: 0, Skipped: 0, Time elapsed: 3.318 sec - in com.zerocracy.pm.time.NegligenceTest
Running com.zerocracy.pm.scope.WbsTest
Tests run: 2, Failures: 0, Errors: 0, Skipped: 0, Time elapsed: 3.568 sec - in com.zerocracy.pm.scope.WbsTest
Running com.zerocracy.pm.cost.RatesTest
Tests run: 1, Failures: 0, Errors: 0, Skipped: 0, Time elapsed: 3.546 sec - in com.zerocracy.pm.cost.RatesTest
Running com.zerocracy.radars.github.RbPingArchitectTest
Tests run: 3, Failures: 0, Errors: 0, Skipped: 0, Time elapsed: 3.997 sec - in com.zerocracy.radars.github.RbPingArchitectTest
Running com.zerocracy.pm.staff.votes.VsReputationTest
Tests run: 1, Failures: 0, Errors: 0, Skipped: 0, Time elapsed: 3.977 sec - in com.zerocracy.pm.staff.votes.VsReputationTest
Running com.zerocracy.pm.in.JobExpiredTest
Tests run: 2, Failures: 0, Errors: 0, Skipped: 0, Time elapsed: 4.162 sec - in com.zerocracy.pm.in.JobExpiredTest
Running com.zerocracy.radars.gitlab.TkGitlabTest
Tests run: 3, Failures: 0, Errors: 0, Skipped: 0, Time elapsed: 0.024 sec - in com.zerocracy.radars.gitlab.TkGitlabTest
Running com.zerocracy.radars.github.RbReleaseTest
Tests run: 1, Failures: 0, Errors: 0, Skipped: 0, Time elapsed: 2.126 sec - in com.zerocracy.radars.github.RbReleaseTest
Running com.zerocracy.tk.RqUserTest
Tests run: 1, Failures: 0, Errors: 0, Skipped: 0, Time elapsed: 0.363 sec - in com.zerocracy.tk.RqUserTest
Running com.zerocracy.farm.props.PropsFarmTest
Tests run: 2, Failures: 0, Errors: 0, Skipped: 0, Time elapsed: 0.005 sec - in com.zerocracy.farm.props.PropsFarmTest
Running com.zerocracy.tk.project.TkArtifactTest
Tests run: 3, Failures: 0, Errors: 0, Skipped: 0, Time elapsed: 1.869 sec - in com.zerocracy.tk.project.TkArtifactTest
Running com.zerocracy.tk.project.RqProjectTest
Tests run: 2, Failures: 0, Errors: 0, Skipped: 0, Time elapsed: 2.872 sec - in com.zerocracy.tk.project.RqProjectTest
Running com.zerocracy.pmo.HintTest
Tests run: 1, Failures: 0, Errors: 0, Skipped: 0, Time elapsed: 5.133 sec - in com.zerocracy.pmo.HintTest
Running com.zerocracy.farm.guts.TkGutsTest
Tests run: 1, Failures: 0, Errors: 0, Skipped: 0, Time elapsed: 4.604 sec - in com.zerocracy.farm.guts.TkGutsTest
Running com.zerocracy.radars.github.ReQuestionTest
Tests run: 1, Failures: 0, Errors: 0, Skipped: 0, Time elapsed: 1.886 sec - in com.zerocracy.radars.github.ReQuestionTest
Running com.zerocracy.entry.ExtMongoTest
Tests run: 3, Failures: 0, Errors: 0, Skipped: 1, Time elapsed: 15.992 sec - in com.zerocracy.entry.ExtMongoTest
Running com.zerocracy.PolicyTest
Tests run: 1, Failures: 0, Errors: 0, Skipped: 0, Time elapsed: 0.003 sec - in com.zerocracy.PolicyTest
Running com.zerocracy.tk.project.TkReportTest
Tests run: 1, Failures: 0, Errors: 0, Skipped: 0, Time elapsed: 22.383 sec - in com.zerocracy.tk.project.TkReportTest
Running com.zerocracy.pm.in.OrdersTest
Tests run: 3, Failures: 0, Errors: 0, Skipped: 0, Time elapsed: 3.142 sec - in com.zerocracy.pm.in.OrdersTest
Running com.zerocracy.radars.viber.TkViberTest
Tests run: 3, Failures: 0, Errors: 0, Skipped: 0, Time elapsed: 1.869 sec - in com.zerocracy.radars.viber.TkViberTest
Running com.zerocracy.pm.staff.votes.VsVacationTest
Tests run: 1, Failures: 0, Errors: 0, Skipped: 0, Time elapsed: 0.492 sec - in com.zerocracy.pm.staff.votes.VsVacationTest
Running com.zerocracy.pmo.OptionsTest
Tests run: 9, Failures: 0, Errors: 0, Skipped: 0, Time elapsed: 0.492 sec - in com.zerocracy.pmo.OptionsTest
Running com.zerocracy.tk.TkDumpTest
Tests run: 1, Failures: 0, Errors: 0, Skipped: 0, Time elapsed: 0.027 sec - in com.zerocracy.tk.TkDumpTest
Running com.zerocracy.tk.TkTeamTest
Tests run: 2, Failures: 0, Errors: 0, Skipped: 0, Time elapsed: 1.322 sec - in com.zerocracy.tk.TkTeamTest
Running com.zerocracy.tk.TkShutdownTest
Tests run: 1, Failures: 0, Errors: 0, Skipped: 0, Time elapsed: 0.092 sec - in com.zerocracy.tk.TkShutdownTest
Running com.zerocracy.tk.project.reports.OrdersGivenByWeekTest
Tests run: 2, Failures: 0, Errors: 0, Skipped: 0, Time elapsed: 1.034 sec - in com.zerocracy.tk.project.reports.OrdersGivenByWeekTest
Running com.zerocracy.pmo.SpeedTest
Tests run: 3, Failures: 0, Errors: 0, Skipped: 0, Time elapsed: 0.455 sec - in com.zerocracy.pmo.SpeedTest
Running com.zerocracy.cash.QuotesTest
Tests run: 1, Failures: 0, Errors: 0, Skipped: 0, Time elapsed: 0 sec - in com.zerocracy.cash.QuotesTest
Running com.zerocracy.farm.reactive.BrigadeTest
Tests run: 3, Failures: 0, Errors: 0, Skipped: 0, Time elapsed: 1.436 sec - in com.zerocracy.farm.reactive.BrigadeTest
Running com.zerocracy.radars.github.RbOnBugTest
Tests run: 1, Failures: 0, Errors: 0, Skipped: 0, Time elapsed: 0.389 sec - in com.zerocracy.radars.github.RbOnBugTest
Running com.zerocracy.pm.staff.ranks.RnkRevTest
Tests run: 1, Failures: 0, Errors: 0, Skipped: 0, Time elapsed: 0.337 sec - in com.zerocracy.pm.staff.ranks.RnkRevTest
Running com.zerocracy.farm.reactive.DefaultFlushTest
Tests run: 1, Failures: 0, Errors: 0, Skipped: 0, Time elapsed: 0.015 sec - in com.zerocracy.farm.reactive.DefaultFlushTest
Running com.zerocracy.farm.footprint.FtFarmTest
Tests run: 1, Failures: 0, Errors: 0, Skipped: 0, Time elapsed: 2.763 sec - in com.zerocracy.farm.footprint.FtFarmTest
Running com.zerocracy.pm.cost.LedgerTest
Tests run: 3, Failures: 0, Errors: 0, Skipped: 0, Time elapsed: 1.623 sec - in com.zerocracy.pm.cost.LedgerTest
Running com.zerocracy.SafeSentryTest
Sentry threw an error: java.lang.RuntimeException: Exceptional!
        at com.zerocracy.SafeSentry.capture(SafeSentry.java:56)
        at com.zerocracy.SafeSentryTest.logsThrownException(SafeSentryTest.java:47)
        at sun.reflect.NativeMethodAccessorImpl.invoke0(Native Method)
        at sun.reflect.NativeMethodAccessorImpl.invoke(NativeMethodAccessorImpl.java:62)
        at sun.reflect.DelegatingMethodAccessorImpl.invoke(DelegatingMethodAccessorImpl.java:43)
        at java.lang.reflect.Method.invoke(Method.java:498)
        at org.junit.runners.model.FrameworkMethod$1.runReflectiveCall(FrameworkMethod.java:50)
        at org.junit.internal.runners.model.ReflectiveCallable.run(ReflectiveCallable.java:12)
        at org.junit.runners.model.FrameworkMethod.invokeExplosively(FrameworkMethod.java:47)
        at org.junit.internal.runners.statements.InvokeMethod.evaluate(InvokeMethod.java:17)
        at org.junit.runners.ParentRunner.runLeaf(ParentRunner.java:325)
        at org.junit.runners.BlockJUnit4ClassRunner.runChild(BlockJUnit4ClassRunner.java:78)
        at org.junit.runners.BlockJUnit4ClassRunner.runChild(BlockJUnit4ClassRunner.java:57)
        at org.junit.runners.ParentRunner$3.run(ParentRunner.java:290)
        at org.apache.maven.surefire.junitcore.pc.Scheduler$1.run(Scheduler.java:393)
        at java.util.concurrent.Executors$RunnableAdapter.call(Executors.java:511)
        at java.util.concurrent.FutureTask.run(FutureTask.java:266)
        at java.util.concurrent.ThreadPoolExecutor.runWorker(ThreadPoolExecutor.java:1149)
        at java.util.concurrent.ThreadPoolExecutor$Worker.run(ThreadPoolExecutor.java:624)
        at java.lang.Thread.run(Thread.java:748)

Tests run: 1, Failures: 0, Errors: 0, Skipped: 0, Time elapsed: 1.403 sec - in com.zerocracy.SafeSentryTest
Running com.zerocracy.tk.profile.TkAwardsTest
Tests run: 2, Failures: 0, Errors: 0, Skipped: 0, Time elapsed: 1.586 sec - in com.zerocracy.tk.profile.TkAwardsTest
Running com.zerocracy.radars.github.RbAddToMilestoneTest
Tests run: 1, Failures: 0, Errors: 0, Skipped: 0, Time elapsed: 0.563 sec - in com.zerocracy.radars.github.RbAddToMilestoneTest
Running com.zerocracy.pm.cost.EquityTest
Tests run: 3, Failures: 0, Errors: 0, Skipped: 1, Time elapsed: 0.611 sec - in com.zerocracy.pm.cost.EquityTest
Running com.zerocracy.pm.staff.ElectionsTest
Tests run: 7, Failures: 0, Errors: 0, Skipped: 0, Time elapsed: 10.921 sec - in com.zerocracy.pm.staff.ElectionsTest
Running com.zerocracy.radars.QuestionTest
Tests run: 5, Failures: 0, Errors: 0, Skipped: 0, Time elapsed: 0.369 sec - in com.zerocracy.radars.QuestionTest
Running com.zerocracy.radars.slack.ReProfileTest
Tests run: 2, Failures: 0, Errors: 0, Skipped: 0, Time elapsed: 2.443 sec - in com.zerocracy.radars.slack.ReProfileTest
Running com.zerocracy.pm.FootprintTest
Duplicate claims are not allowed in FOOTPRNTZ, can't add this XML to 1 existing ones:
<?xml version="1.0" encoding="UTF-8"?>
<claim id="2151302328">
   <created>2018-08-03T13:02:11.271Z</created>
   <type>Hello</type>
</claim>

Tests run: 4, Failures: 0, Errors: 0, Skipped: 1, Time elapsed: 10.267 sec - in com.zerocracy.pm.FootprintTest
Running com.zerocracy.tk.project.reports.OrderChampionsTest
Tests run: 1, Failures: 0, Errors: 0, Skipped: 0, Time elapsed: 0.448 sec - in com.zerocracy.tk.project.reports.OrderChampionsTest
Running com.zerocracy.pm.cost.EstimatesTest
Tests run: 3, Failures: 0, Errors: 0, Skipped: 0, Time elapsed: 1.706 sec - in com.zerocracy.pm.cost.EstimatesTest
Running com.zerocracy.pmo.VacanciesTest
Tests run: 4, Failures: 0, Errors: 0, Skipped: 0, Time elapsed: 0.156 sec - in com.zerocracy.pmo.VacanciesTest
Running com.zerocracy.tk.RsPageTest
Tests run: 1, Failures: 0, Errors: 0, Skipped: 0, Time elapsed: 0.143 sec - in com.zerocracy.tk.RsPageTest
Running com.zerocracy.pm.staff.votes.VsRandomTest
Tests run: 1, Failures: 0, Errors: 0, Skipped: 0, Time elapsed: 0.532 sec - in com.zerocracy.pm.staff.votes.VsRandomTest
Running com.zerocracy.farm.StkSafeTest
*** Couldn't find a suitable DSN, Sentry operations will do nothing! See documentation: https://docs.sentry.io/clients/java/ ***
*** Couldn't find a suitable DSN, Sentry operations will do nothing! See documentation: https://docs.sentry.io/clients/java/ ***
*** Couldn't find a suitable DSN, Sentry operations will do nothing! See documentation: https://docs.sentry.io/clients/java/ ***
Tests run: 3, Failures: 0, Errors: 0, Skipped: 0, Time elapsed: 1.43 sec - in com.zerocracy.farm.StkSafeTest
Running com.zerocracy.XocumentTest
Tests run: 2, Failures: 0, Errors: 0, Skipped: 1, Time elapsed: 1.251 sec - in com.zerocracy.XocumentTest
Running com.zerocracy.pm.staff.ranks.RnkEstimatesTest
Tests run: 2, Failures: 0, Errors: 0, Skipped: 0, Time elapsed: 2.548 sec - in com.zerocracy.pm.staff.ranks.RnkEstimatesTest
Running com.zerocracy.cash.ApiLayerQuotesTest
From EUR to USD: 0.800000
Tests run: 2, Failures: 0, Errors: 0, Skipped: 0, Time elapsed: 2.403 sec - in com.zerocracy.cash.ApiLayerQuotesTest
Running com.zerocracy.farm.ruled.RdIndexTest
Tests run: 1, Failures: 0, Errors: 0, Skipped: 0, Time elapsed: 0.05 sec - in com.zerocracy.farm.ruled.RdIndexTest
Running com.zerocracy.pm.in.ImpedimentsTest
Tests run: 3, Failures: 0, Errors: 0, Skipped: 0, Time elapsed: 0.703 sec - in com.zerocracy.pm.in.ImpedimentsTest
Running com.zerocracy.radars.github.RbMilestoneTest
Tests run: 1, Failures: 0, Errors: 0, Skipped: 0, Time elapsed: 0.304 sec - in com.zerocracy.radars.github.RbMilestoneTest
Running com.zerocracy.pm.staff.votes.VsBalanceTest
Tests run: 3, Failures: 0, Errors: 0, Skipped: 0, Time elapsed: 0.288 sec - in com.zerocracy.pm.staff.votes.VsBalanceTest
Running com.zerocracy.radars.slack.RealSkSessionTest
Tests run: 1, Failures: 0, Errors: 0, Skipped: 0, Time elapsed: 0.429 sec - in com.zerocracy.radars.slack.RealSkSessionTest
Running com.zerocracy.tk.CcSecureTest
Tests run: 1, Failures: 0, Errors: 0, Skipped: 0, Time elapsed: 0.679 sec - in com.zerocracy.tk.CcSecureTest
Running com.zerocracy.pm.time.PrecedencesTest
Tests run: 1, Failures: 0, Errors: 0, Skipped: 0, Time elapsed: 0.36 sec - in com.zerocracy.pm.time.PrecedencesTest
Running com.zerocracy.farm.reactive.AsyncFlushTest
Tests run: 1, Failures: 0, Errors: 0, Skipped: 0, Time elapsed: 4.316 sec - in com.zerocracy.farm.reactive.AsyncFlushTest
Running com.zerocracy.radars.viber.VbEventTest
Tests run: 2, Failures: 0, Errors: 0, Skipped: 0, Time elapsed: 0.007 sec - in com.zerocracy.radars.viber.VbEventTest
Running com.zerocracy.farm.sync.SyncProjectTest
Tests run: 1, Failures: 0, Errors: 0, Skipped: 0, Time elapsed: 0.004 sec - in com.zerocracy.farm.sync.SyncProjectTest
Running com.zerocracy.radars.slack.SlackRadarTest
Tests run: 2, Failures: 0, Errors: 0, Skipped: 0, Time elapsed: 0.794 sec - in com.zerocracy.radars.slack.SlackRadarTest
Running com.zerocracy.tk.TkBoardTest
Tests run: 2, Failures: 0, Errors: 0, Skipped: 0, Time elapsed: 0.908 sec - in com.zerocracy.tk.TkBoardTest
Running com.zerocracy.entry.PingTest
*** Couldn't find a suitable DSN, Sentry operations will do nothing! See documentation: https://docs.sentry.io/clients/java/ ***
Tests run: 2, Failures: 0, Errors: 0, Skipped: 0, Time elapsed: 1.659 sec - in com.zerocracy.entry.PingTest
Running com.zerocracy.pmo.BlanksTest
Tests run: 1, Failures: 0, Errors: 0, Skipped: 0, Time elapsed: 0.181 sec - in com.zerocracy.pmo.BlanksTest
Running com.zerocracy.XsdResolverTest
Tests run: 6, Failures: 0, Errors: 0, Skipped: 0, Time elapsed: 0.4 sec - in com.zerocracy.XsdResolverTest
Running com.zerocracy.pm.staff.ranks.RnkGithubBugTest
Tests run: 2, Failures: 0, Errors: 0, Skipped: 0, Time elapsed: 0.17 sec - in com.zerocracy.pm.staff.ranks.RnkGithubBugTest
Running com.zerocracy.pm.staff.votes.VsOverElectedTest
Tests run: 3, Failures: 0, Errors: 0, Skipped: 0, Time elapsed: 2.986 sec - in com.zerocracy.pm.staff.votes.VsOverElectedTest
Running com.zerocracy.pmo.VerbosityTest
Tests run: 2, Failures: 0, Errors: 0, Skipped: 1, Time elapsed: 0.08 sec - in com.zerocracy.pmo.VerbosityTest
Running com.zerocracy.tk.profile.TkAgendaTest
Tests run: 4, Failures: 0, Errors: 0, Skipped: 0, Time elapsed: 1.466 sec - in com.zerocracy.tk.profile.TkAgendaTest
Running com.zerocracy.pm.time.votes.VsNegligenceTest
Tests run: 1, Failures: 0, Errors: 0, Skipped: 0, Time elapsed: 0.001 sec - in com.zerocracy.pm.time.votes.VsNegligenceTest
Running com.zerocracy.radars.github.RbOnCloseTest
Tests run: 2, Failures: 0, Errors: 0, Skipped: 0, Time elapsed: 0.449 sec - in com.zerocracy.radars.github.RbOnCloseTest
Running com.zerocracy.pm.staff.votes.VsSpeedTest
Tests run: 2, Failures: 0, Errors: 0, Skipped: 0, Time elapsed: 0.231 sec - in com.zerocracy.pm.staff.votes.VsSpeedTest
Running com.zerocracy.pmo.DebtsTest
Tests run: 4, Failures: 0, Errors: 0, Skipped: 0, Time elapsed: 0.31 sec - in com.zerocracy.pmo.DebtsTest
Running com.zerocracy.radars.github.RbByLabelTest
Tests run: 2, Failures: 0, Errors: 0, Skipped: 0, Time elapsed: 0.025 sec - in com.zerocracy.radars.github.RbByLabelTest
Running com.zerocracy.tk.TkVacanciesTest
Tests run: 1, Failures: 0, Errors: 0, Skipped: 0, Time elapsed: 2.226 sec - in com.zerocracy.tk.TkVacanciesTest
Running com.zerocracy.entry.HeapDumpTest
Tests run: 5, Failures: 0, Errors: 0, Skipped: 0, Time elapsed: 0.031 sec - in com.zerocracy.entry.HeapDumpTest
Running com.zerocracy.entry.ExtMongobeeTest
Tests run: 1, Failures: 0, Errors: 0, Skipped: 0, Time elapsed: 5.989 sec - in com.zerocracy.entry.ExtMongobeeTest
Running com.zerocracy.pm.staff.ranks.RnkBoostTest
Tests run: 1, Failures: 0, Errors: 0, Skipped: 0, Time elapsed: 0.401 sec - in com.zerocracy.pm.staff.ranks.RnkBoostTest
Running com.zerocracy.TxnTest
Tests run: 3, Failures: 0, Errors: 0, Skipped: 1, Time elapsed: 0.008 sec - in com.zerocracy.TxnTest
Running com.zerocracy.pmo.banks.PayrollTest
Tests run: 4, Failures: 0, Errors: 0, Skipped: 0, Time elapsed: 0.014 sec - in com.zerocracy.pmo.banks.PayrollTest
Running com.zerocracy.claims.proc.BrigadeProcTest
Tests run: 1, Failures: 0, Errors: 0, Skipped: 0, Time elapsed: 0.332 sec - in com.zerocracy.claims.proc.BrigadeProcTest
Running com.zerocracy.pm.ClaimOutTest
#error(): Claim param name "author" is prohibited to use in "Hello dude", since it will clash with other claim attributes
#fatalError(): Processing terminated by xsl:message at line 26 in file:///; SystemID: file:///; Line#: 26; Column#: 5
#error(): Duplicated flow detected, something is wrong: "Hey; Hey; Hey", seems to be an endless recursion in claims
#fatalError(): Processing terminated by xsl:message at line 28 in file:///; SystemID: file:///; Line#: 28
#error(): Claim cause "some text while a number expected" is not valid number
#fatalError(): Processing terminated by xsl:message at line 26 in file:///; SystemID: file:///; Line#: 26; Column#: 6
#error(): Job name "this is not a job" is not valid
#fatalError(): Processing terminated by xsl:message at line 27 in file:///; SystemID: file:///; Line#: 27; Column#: 6
#error(): Role name "this is not a role" is not valid
#fatalError(): Processing terminated by xsl:message at line 27 in file:///; SystemID: file:///; Line#: 27; Column#: 6
Tests run: 3, Failures: 0, Errors: 0, Skipped: 0, Time elapsed: 1.639 sec - in com.zerocracy.pm.ClaimOutTest
Running com.zerocracy.pmo.recharge.RechargeTest
Tests run: 1, Failures: 0, Errors: 0, Skipped: 0, Time elapsed: 0.377 sec - in com.zerocracy.pmo.recharge.RechargeTest
Running com.zerocracy.pm.ClaimInTest
Tests run: 4, Failures: 0, Errors: 0, Skipped: 0, Time elapsed: 0.107 sec - in com.zerocracy.pm.ClaimInTest
Running com.zerocracy.radars.github.TkGithubTest
Tests run: 2, Failures: 0, Errors: 0, Skipped: 0, Time elapsed: 0.153 sec - in com.zerocracy.radars.github.TkGithubTest
Running com.zerocracy.claims.proc.FootprintProcTest
Tests run: 1, Failures: 0, Errors: 0, Skipped: 0, Time elapsed: 1.44 sec - in com.zerocracy.claims.proc.FootprintProcTest
Running com.zerocracy.ParTest
Tests run: 5, Failures: 0, Errors: 0, Skipped: 0, Time elapsed: 0.006 sec - in com.zerocracy.ParTest
Running com.zerocracy.farm.reactive.StkGroovyTest
Tests run: 4, Failures: 0, Errors: 0, Skipped: 0, Time elapsed: 0.525 sec - in com.zerocracy.farm.reactive.StkGroovyTest
Running com.zerocracy.pm.staff.votes.VsNoRoomTest
Tests run: 1, Failures: 0, Errors: 0, Skipped: 0, Time elapsed: 0.382 sec - in com.zerocracy.pm.staff.votes.VsNoRoomTest
Running com.zerocracy.farm.fake.FkProjectTest
Tests run: 4, Failures: 0, Errors: 0, Skipped: 0, Time elapsed: 0.002 sec - in com.zerocracy.farm.fake.FkProjectTest
Running com.zerocracy.farm.fake.FkFarmTest
Tests run: 7, Failures: 0, Errors: 0, Skipped: 0, Time elapsed: 0.011 sec - in com.zerocracy.farm.fake.FkFarmTest
Running com.zerocracy.tk.profile.TkIdentifyTest
Tests run: 1, Failures: 0, Errors: 0, Skipped: 0, Time elapsed: 2.284 sec - in com.zerocracy.tk.profile.TkIdentifyTest
Running com.zerocracy.pm.staff.votes.VsBannedTest
Tests run: 2, Failures: 0, Errors: 0, Skipped: 0, Time elapsed: 0.589 sec - in com.zerocracy.pm.staff.votes.VsBannedTest
Running com.zerocracy.farm.S3ProjectTest
Tests run: 2, Failures: 0, Errors: 0, Skipped: 0, Time elapsed: 0.622 sec - in com.zerocracy.farm.S3ProjectTest
Running com.zerocracy.pmo.banks.FkBankTest
Tests run: 8, Failures: 0, Errors: 0, Skipped: 0, Time elapsed: 0.014 sec - in com.zerocracy.pmo.banks.FkBankTest
Running com.zerocracy.claims.ClaimSignatureTest
Tests run: 5, Failures: 0, Errors: 0, Skipped: 0, Time elapsed: 2.644 sec - in com.zerocracy.claims.ClaimSignatureTest
Running com.zerocracy.tk.TkJoinTest
Tests run: 6, Failures: 0, Errors: 0, Skipped: 1, Time elapsed: 1.608 sec - in com.zerocracy.tk.TkJoinTest
Running com.zerocracy.pm.staff.votes.VsLosersTest
Tests run: 1, Failures: 0, Errors: 0, Skipped: 0, Time elapsed: 0.004 sec - in com.zerocracy.pm.staff.votes.VsLosersTest
Running com.zerocracy.entry.PingsTest
Tests run: 1, Failures: 0, Errors: 0, Skipped: 0, Time elapsed: 1.346 sec - in com.zerocracy.entry.PingsTest
Running com.zerocracy.pm.ClaimsItemTest
Duplicate claims are not allowed in FAKEPRJCT, can't add this XML to 1 existing ones:
<?xml version="1.0" encoding="UTF-8"?>
<claim id="2151303809">
   <created>2018-08-03T13:03:24.056Z</created>
   <type>hello future</type>
</claim>

Tests run: 6, Failures: 0, Errors: 0, Skipped: 2, Time elapsed: 0.154 sec - in com.zerocracy.pm.ClaimsItemTest
Running com.zerocracy.farm.sync.SyncFarmTest
Thread 13060/Thread-338 interrupted because of too long hold of "expectedfailure.xml" in PMO (over 1000 msec), f0c156b3c3d8/1s/0/1/true/false by Thread-338: java.lang.IllegalStateException: Here!
        at com.zerocracy.farm.sync.Terminator.killer(Terminator.java:127)
        at com.zerocracy.farm.sync.Terminator.submit(Terminator.java:108)
        at com.zerocracy.farm.sync.SyncProject.acq(SyncProject.java:95)
        at com.zerocracy.pmo.Pmo.acq(Pmo.java:62)
        at com.zerocracy.farm.sync.SyncFarmTest.lambda$interruptsTooLongThread$1(SyncFarmTest.java:93)
        at org.cactoos.func.FuncOf.lambda$new$3(FuncOf.java:88)
        at org.cactoos.func.FuncOf.apply(FuncOf.java:104)
        at org.cactoos.func.UncheckedFunc.lambda$apply$0(UncheckedFunc.java:58)
        at org.cactoos.scalar.IoCheckedScalar.value(IoCheckedScalar.java:70)
        at org.cactoos.scalar.UncheckedScalar.value(UncheckedScalar.java:58)
        at org.cactoos.func.UncheckedFunc.apply(UncheckedFunc.java:59)
        at org.cactoos.func.RunnableOf.run(RunnableOf.java:89)
        at java.lang.Thread.run(Thread.java:748)

*** Couldn't find a suitable DSN, Sentry operations will do nothing! See documentation: https://docs.sentry.io/clients/java/ ***
swallowed exception: java.lang.IllegalMonitorStateException
        at java.util.concurrent.locks.ReentrantLock$Sync.tryRelease(ReentrantLock.java:151)
        at java.util.concurrent.locks.AbstractQueuedSynchronizer.release(AbstractQueuedSynchronizer.java:1261)
        at java.util.concurrent.locks.ReentrantLock.unlock(ReentrantLock.java:457)
        at com.zerocracy.farm.SmartLock.unlock(SmartLock.java:138)
        at com.zerocracy.farm.sync.Terminator.lambda$killer$1(Terminator.java:157)
        at org.cactoos.func.FuncOf.lambda$new$3(FuncOf.java:88)
        at org.cactoos.func.FuncOf.apply(FuncOf.java:104)
        at org.cactoos.func.UncheckedFunc.lambda$apply$0(UncheckedFunc.java:58)
        at org.cactoos.scalar.IoCheckedScalar.value(IoCheckedScalar.java:70)
        at org.cactoos.scalar.UncheckedScalar.value(UncheckedScalar.java:58)
        at org.cactoos.func.UncheckedFunc.apply(UncheckedFunc.java:59)
        at org.cactoos.func.RunnableOf.run(RunnableOf.java:89)
        at com.jcabi.log.VerboseRunnable.run(VerboseRunnable.java:190)
        at java.util.concurrent.Executors$RunnableAdapter.call(Executors.java:511)
        at java.util.concurrent.FutureTask.run(FutureTask.java:266)
        at java.util.concurrent.ThreadPoolExecutor.runWorker(ThreadPoolExecutor.java:1149)
        at java.util.concurrent.ThreadPoolExecutor$Worker.run(ThreadPoolExecutor.java:624)
        at com.jcabi.log.VerboseThreads$Wrap.run(VerboseThreads.java:221)
        at java.lang.Thread.run(Thread.java:748)

*** Couldn't find a suitable DSN, Sentry operations will do nothing! See documentation: https://docs.sentry.io/clients/java/ ***
Tests run: 3, Failures: 0, Errors: 0, Skipped: 1, Time elapsed: 3.698 sec - in com.zerocracy.farm.sync.SyncFarmTest
Running com.zerocracy.tk.TkPulseTest
Tests run: 1, Failures: 0, Errors: 0, Skipped: 0, Time elapsed: 0.753 sec - in com.zerocracy.tk.TkPulseTest
Running com.zerocracy.pmo.BotsTest
Tests run: 1, Failures: 0, Errors: 0, Skipped: 0, Time elapsed: 0.022 sec - in com.zerocracy.pmo.BotsTest
Running com.zerocracy.pmo.AgendaTest
Tests run: 9, Failures: 0, Errors: 0, Skipped: 0, Time elapsed: 0.635 sec - in com.zerocracy.pmo.AgendaTest
Running com.zerocracy.cash.CurrencyTest
Tests run: 2, Failures: 0, Errors: 0, Skipped: 0, Time elapsed: 0.038 sec - in com.zerocracy.cash.CurrencyTest
Running com.zerocracy.pmo.ProjectsTest
Tests run: 1, Failures: 0, Errors: 0, Skipped: 0, Time elapsed: 0.009 sec - in com.zerocracy.pmo.ProjectsTest
Running com.zerocracy.cash.PairTest
Tests run: 10, Failures: 0, Errors: 0, Skipped: 0, Time elapsed: 0.038 sec - in com.zerocracy.cash.PairTest
Running com.zerocracy.pmo.ResumesTest
Tests run: 2, Failures: 0, Errors: 0, Skipped: 0, Time elapsed: 0.25 sec - in com.zerocracy.pmo.ResumesTest
Running com.zerocracy.radars.viber.VbBotTest
Aug 03, 2018 1:03:21 PM com.sun.grizzly.Controller logVersion
INFO: GRIZZLY0001: Starting Grizzly Framework 1.9.65 - 8/3/18 1:03 PM
Tests run: 1, Failures: 0, Errors: 0, Skipped: 0, Time elapsed: 4.294 sec - in com.zerocracy.radars.viber.VbBotTest
Running com.zerocracy.pm.qa.ReviewsTest
Tests run: 4, Failures: 0, Errors: 0, Skipped: 0, Time elapsed: 0.3 sec - in com.zerocracy.pm.qa.ReviewsTest
Running com.zerocracy.tk.project.TkFootprintTest
Tests run: 2, Failures: 0, Errors: 0, Skipped: 0, Time elapsed: 1.656 sec - in com.zerocracy.tk.project.TkFootprintTest
Running com.zerocracy.farm.reactive.StkSmartTest
Tests run: 3, Failures: 0, Errors: 0, Skipped: 0, Time elapsed: 0.051 sec - in com.zerocracy.farm.reactive.StkSmartTest
Running com.zerocracy.pmo.CatalogTest
Tests run: 7, Failures: 0, Errors: 0, Skipped: 0, Time elapsed: 0.518 sec - in com.zerocracy.pmo.CatalogTest
Running com.zerocracy.radars.github.RbOnUnassignTest
Tests run: 1, Failures: 0, Errors: 0, Skipped: 0, Time elapsed: 0.129 sec - in com.zerocracy.radars.github.RbOnUnassignTest
Running com.zerocracy.pm.staff.BansTest
Tests run: 2, Failures: 0, Errors: 0, Skipped: 0, Time elapsed: 0.22 sec - in com.zerocracy.pm.staff.BansTest
Running com.zerocracy.pmo.RfpsTest
Tests run: 3, Failures: 0, Errors: 0, Skipped: 0, Time elapsed: 1.252 sec - in com.zerocracy.pmo.RfpsTest
Running com.zerocracy.pm.cost.VestingTest
Tests run: 2, Failures: 0, Errors: 0, Skipped: 0, Time elapsed: 0.122 sec - in com.zerocracy.pm.cost.VestingTest
Running com.zerocracy.tk.profile.TkProfileTest
Tests run: 6, Failures: 0, Errors: 0, Skipped: 0, Time elapsed: 2.315 sec - in com.zerocracy.tk.profile.TkProfileTest
Running com.zerocracy.farm.guts.GsProjectTest
Tests run: 1, Failures: 0, Errors: 0, Skipped: 0, Time elapsed: 0.317 sec - in com.zerocracy.farm.guts.GsProjectTest
Running com.zerocracy.farm.SmartLockTest
Tests run: 4, Failures: 0, Errors: 0, Skipped: 0, Time elapsed: 0.122 sec - in com.zerocracy.farm.SmartLockTest
Running com.zerocracy.cash.CashTest
From EUR to USD: 0.800000
Tests run: 16, Failures: 0, Errors: 0, Skipped: 0, Time elapsed: 2.031 sec - in com.zerocracy.cash.CashTest
Running com.zerocracy.pm.ClaimOutSafeTest
Failed to post claim: java.lang.IllegalStateException: submit failed
        at com.zerocracy.pm.ClaimOutSafeTest.lambda$swallowAllExceptions$0(ClaimOutSafeTest.java:41)
        at com.zerocracy.claims.ClaimOut.postTo(ClaimOut.java:107)
        at com.zerocracy.claims.ClaimOutSafe.postTo(ClaimOutSafe.java:51)
        at com.zerocracy.pm.ClaimOutSafeTest.swallowAllExceptions(ClaimOutSafeTest.java:39)
        at sun.reflect.NativeMethodAccessorImpl.invoke0(Native Method)
        at sun.reflect.NativeMethodAccessorImpl.invoke(NativeMethodAccessorImpl.java:62)
        at sun.reflect.DelegatingMethodAccessorImpl.invoke(DelegatingMethodAccessorImpl.java:43)
        at java.lang.reflect.Method.invoke(Method.java:498)
        at org.junit.runners.model.FrameworkMethod$1.runReflectiveCall(FrameworkMethod.java:50)
        at org.junit.internal.runners.model.ReflectiveCallable.run(ReflectiveCallable.java:12)
        at org.junit.runners.model.FrameworkMethod.invokeExplosively(FrameworkMethod.java:47)
        at org.junit.internal.runners.statements.InvokeMethod.evaluate(InvokeMethod.java:17)
        at org.junit.rules.ExpectedException$ExpectedExceptionStatement.evaluate(ExpectedException.java:239)
        at org.junit.rules.RunRules.evaluate(RunRules.java:20)
        at org.junit.runners.ParentRunner.runLeaf(ParentRunner.java:325)
        at org.junit.runners.BlockJUnit4ClassRunner.runChild(BlockJUnit4ClassRunner.java:78)
        at org.junit.runners.BlockJUnit4ClassRunner.runChild(BlockJUnit4ClassRunner.java:57)
        at org.junit.runners.ParentRunner$3.run(ParentRunner.java:290)
        at org.apache.maven.surefire.junitcore.pc.Scheduler$1.run(Scheduler.java:393)
        at java.util.concurrent.Executors$RunnableAdapter.call(Executors.java:511)
        at java.util.concurrent.FutureTask.run(FutureTask.java:266)
        at java.util.concurrent.ThreadPoolExecutor.runWorker(ThreadPoolExecutor.java:1149)
        at java.util.concurrent.ThreadPoolExecutor$Worker.run(ThreadPoolExecutor.java:624)
        at java.lang.Thread.run(Thread.java:748)

Tests run: 1, Failures: 0, Errors: 0, Skipped: 0, Time elapsed: 0.488 sec - in com.zerocracy.pm.ClaimOutSafeTest
Running com.zerocracy.pm.time.MilestonesTest
Tests run: 1, Failures: 0, Errors: 0, Skipped: 0, Time elapsed: 0.442 sec - in com.zerocracy.pm.time.MilestonesTest
Running com.zerocracy.pm.staff.RolesTest
Tests run: 2, Failures: 0, Errors: 0, Skipped: 0, Time elapsed: 0.853 sec - in com.zerocracy.pm.staff.RolesTest
Running com.zerocracy.pm.cost.BoostsTest
Tests run: 3, Failures: 0, Errors: 0, Skipped: 0, Time elapsed: 0.775 sec - in com.zerocracy.pm.cost.BoostsTest
Running com.zerocracy.pmo.AwardsTest
Tests run: 1, Failures: 0, Errors: 0, Skipped: 0, Time elapsed: 0.255 sec - in com.zerocracy.pmo.AwardsTest
Running com.zerocracy.tk.project.reports.AwardChampionsTest
Tests run: 1, Failures: 0, Errors: 0, Skipped: 0, Time elapsed: 0.859 sec - in com.zerocracy.tk.project.reports.AwardChampionsTest
Running com.zerocracy.entry.ExtGithubTest
Tests run: 1, Failures: 0, Errors: 0, Skipped: 0, Time elapsed: 0.01 sec - in com.zerocracy.entry.ExtGithubTest
Running com.zerocracy.tk.project.TkXmlTest
Tests run: 1, Failures: 0, Errors: 0, Skipped: 0, Time elapsed: 1.169 sec - in com.zerocracy.tk.project.TkXmlTest
Running com.zerocracy.pm.staff.votes.VsWorkloadTest
Tests run: 2, Failures: 0, Errors: 0, Skipped: 0, Time elapsed: 1.468 sec - in com.zerocracy.pm.staff.votes.VsWorkloadTest
Running com.zerocracy.pm.staff.votes.VsOptionsMaxJobsTest
Tests run: 2, Failures: 0, Errors: 0, Skipped: 0, Time elapsed: 2.847 sec - in com.zerocracy.pm.staff.votes.VsOptionsMaxJobsTest
Running com.zerocracy.entry.PingsITTest
Tests run: 1, Failures: 0, Errors: 0, Skipped: 1, Time elapsed: 0 sec - in com.zerocracy.entry.PingsITTest
Running com.zerocracy.tk.project.TkProjectTest
Tests run: 1, Failures: 0, Errors: 0, Skipped: 0, Time elapsed: 1.94 sec - in com.zerocracy.tk.project.TkProjectTest
Running com.zerocracy.farm.reactive.RvProjectTest
Tests run: 2, Failures: 0, Errors: 0, Skipped: 0, Time elapsed: 21.74 sec - in com.zerocracy.farm.reactive.RvProjectTest
Running [/add_to_slack]
Tests run: 10, Failures: 0, Errors: 0, Skipped: 0, Time elapsed: 5.01 sec - in [/add_to_slack]
Running [modifies_vacation_mode on]
Tests run: 3, Failures: 0, Errors: 0, Skipped: 0, Time elapsed: 5.283 sec - in [modifies_vacation_mode on]
Running [com/zerocracy/bundles/zerocrat_assignment_adds_to_wbs]
*** Couldn't find a suitable DSN, Sentry operations will do nothing! See documentation: https://docs.sentry.io/clients/java/ ***
Tests run: 74, Failures: 0, Errors: 0, Skipped: 0, Time elapsed: 180.42 sec - in [com/zerocracy/bundles/zerocrat_assignment_adds_to_wbs]
Running com.zerocracy.tk.TkIndexTest
Tests run: 1, Failures: 0, Errors: 0, Skipped: 0, Time elapsed: 1.039 sec - in com.zerocracy.tk.TkIndexTest
Running com.zerocracy.farm.ruled.RdFarmTest
Tests run: 2, Failures: 0, Errors: 0, Skipped: 0, Time elapsed: 3.532 sec - in com.zerocracy.farm.ruled.RdFarmTest
Running com.zerocracy.farm.ruled.RdItemTest
swallowed exception: java.lang.IllegalStateException('http://datum.zerocracy.com/latest/rules/pm/no-lost-boosts.xsl says: The boost for job "gh:test/test#55" exists in boosts.xml, but the job is absent in the WBS among 0 jobs.')
Tests run: 5, Failures: 0, Errors: 0, Skipped: 0, Time elapsed: 3.709 sec - in com.zerocracy.farm.ruled.RdItemTest
Running com.zerocracy.tk.project.TkClaimTest
Tests run: 3, Failures: 0, Errors: 0, Skipped: 0, Time elapsed: 32.885 sec - in com.zerocracy.tk.project.TkClaimTest
Running com.zerocracy.farm.reactive.RvAliveTest
Tests run: 1, Failures: 0, Errors: 0, Skipped: 0, Time elapsed: 0.272 sec - in com.zerocracy.farm.reactive.RvAliveTest
Running com.zerocracy.tk.TkAppTest
Tests run: 2, Failures: 0, Errors: 0, Skipped: 0, Time elapsed: 2.107 sec - in com.zerocracy.tk.TkAppTest
Running com.zerocracy.farm.SmartFarmTest
swallowed exception: java.lang.IllegalStateException('http://datum.zerocracy.com/latest/rules/pm/no-lost-orders.xsl says: The order for job "gh:test/test#22" exists in orders.xml, but the job is absent in the WBS among 0 jobs.')
Tests run: 6, Failures: 0, Errors: 0, Skipped: 0, Time elapsed: 12.916 sec - in com.zerocracy.farm.SmartFarmTest
Running com.zerocracy.pm.time.ReleasesTest
Tests run: 2, Failures: 0, Errors: 0, Skipped: 0, Time elapsed: 1.426 sec - in com.zerocracy.pm.time.ReleasesTest
Running com.zerocracy.pmo.PeopleTest
Tests run: 46, Failures: 0, Errors: 0, Skipped: 0, Time elapsed: 2.433 sec - in com.zerocracy.pmo.PeopleTest
Running com.zerocracy.tools.SignatureTest
Tests run: 1, Failures: 0, Errors: 0, Skipped: 1, Time elapsed: 0 sec - in com.zerocracy.tools.SignatureTest
Running com.zerocracy.farm.S3FarmTest
Tests run: 4, Failures: 0, Errors: 0, Skipped: 0, Time elapsed: 1.658 sec - in com.zerocracy.farm.S3FarmTest

Results :

Tests run: 514, Failures: 0, Errors: 0, Skipped: 12

[0;37mINFOm] org.hibernate.validator.internal.util.Version: HV000001: Hibernate Validator 5.1.2.Final
+ git remote add heroku git@heroku.com:zerocrat.git
+ mkdir /home/r/.ssh
+ mv ../id_rsa ../id_rsa.pub /home/r/.ssh
+ chmod -R 600 /home/r/.ssh/id_rsa /home/r/.ssh/id_rsa.pub
+ echo -e 'Host *\n  StrictHostKeyChecking no\n  UserKnownHostsFile=/dev/null'
+ git fetch
Warning: Permanently added 'github.com,192.30.253.112' (RSA) to the list of known hosts.
+ git add settings.xml
+ mvn initialize -Pshutdown --settings ../settings.xml
[INFO] Scanning for projects...
[INFO]
[INFO] ------------------------------------------------------------------------
[INFO] Building farm 0.28.15
[INFO] ------------------------------------------------------------------------
Downloading: https://oss.sonatype.org/content/groups/public/org/codehaus/gmaven/groovy-maven-plugin/2.0/groovy-maven-plugin-2.0.pom
Downloaded: https://oss.sonatype.org/content/groups/public/org/codehaus/gmaven/groovy-maven-plugin/2.0/groovy-maven-plugin-2.0.pom (5 KB at 4.9 KB/sec)
Downloading: https://oss.sonatype.org/content/groups/public/org/codehaus/gmaven/gmaven/2.0/gmaven-2.0.pom
Downloaded: https://oss.sonatype.org/content/groups/public/org/codehaus/gmaven/gmaven/2.0/gmaven-2.0.pom (21 KB at 55.5 KB/sec)
Downloading: https://oss.sonatype.org/content/groups/public/org/codehaus/gmaven/groovy-maven-plugin/2.0/groovy-maven-plugin-2.0.jar
Downloaded: https://oss.sonatype.org/content/groups/public/org/codehaus/gmaven/groovy-maven-plugin/2.0/groovy-maven-plugin-2.0.jar (48 KB at 119.2 KB/sec)
[WARNING] The artifact org.hibernate:hibernate-validator:jar:6.0.2.Final has been relocated to org.hibernate.validator:hibernate-validator:jar:6.0.2.Final
[INFO]
[INFO] --- maven-enforcer-plugin:1.4.1:enforce (enforce-maven) @ farm ---
[INFO]
[INFO] --- buildnumber-maven-plugin:1.4:create (jcabi-build-number) @ farm ---
[INFO] ShortRevision tag detected. The value is '7'.
[INFO] Executing: /bin/sh -c cd '/home/r/repo' && 'git' 'rev-parse' '--verify' '--short=7' 'HEAD'
[INFO] Working directory: /home/r/repo
[INFO] Storing buildNumber: f34eeb7 at timestamp: 2018-08-03T13:04:52
[INFO] Storing buildScmBranch: __rultor
[INFO]
[INFO] --- buildnumber-maven-plugin:1.4:create-timestamp (jcabi-build-number) @ farm ---
[INFO]
[INFO] --- groovy-maven-plugin:2.0:execute (shutdown) @ farm ---
Downloading: https://oss.sonatype.org/content/groups/public/org/sonatype/gossip/gossip-slf4j/1.8/gossip-slf4j-1.8.pom
Downloading: https://repo.maven.apache.org/maven2/org/sonatype/gossip/gossip-slf4j/1.8/gossip-slf4j-1.8.pom
Downloaded: https://repo.maven.apache.org/maven2/org/sonatype/gossip/gossip-slf4j/1.8/gossip-slf4j-1.8.pom (2 KB at 18.6 KB/sec)
Downloading: https://oss.sonatype.org/content/groups/public/org/sonatype/gossip/gossip/1.8/gossip-1.8.pom
Downloading: https://repo.maven.apache.org/maven2/org/sonatype/gossip/gossip/1.8/gossip-1.8.pom
Downloaded: https://repo.maven.apache.org/maven2/org/sonatype/gossip/gossip/1.8/gossip-1.8.pom (12 KB at 388.1 KB/sec)
Downloading: https://oss.sonatype.org/content/groups/public/org/sonatype/forge/forge-parent/9/forge-parent-9.pom
Downloading: https://repo.maven.apache.org/maven2/org/sonatype/forge/forge-parent/9/forge-parent-9.pom
Downloaded: https://repo.maven.apache.org/maven2/org/sonatype/forge/forge-parent/9/forge-parent-9.pom (13 KB at 377.5 KB/sec)
Downloading: https://oss.sonatype.org/content/groups/public/org/sonatype/gossip/gossip-core/1.8/gossip-core-1.8.pom
Downloading: https://repo.maven.apache.org/maven2/org/sonatype/gossip/gossip-core/1.8/gossip-core-1.8.pom
Downloaded: https://repo.maven.apache.org/maven2/org/sonatype/gossip/gossip-core/1.8/gossip-core-1.8.pom (3 KB at 58.7 KB/sec)
Downloading: https://oss.sonatype.org/content/groups/public/org/sonatype/gossip/gossip-bootstrap/1.8/gossip-bootstrap-1.8.pom
Downloading: https://repo.maven.apache.org/maven2/org/sonatype/gossip/gossip-bootstrap/1.8/gossip-bootstrap-1.8.pom
Downloaded: https://repo.maven.apache.org/maven2/org/sonatype/gossip/gossip-bootstrap/1.8/gossip-bootstrap-1.8.pom (2 KB at 62.9 KB/sec)
Downloading: https://oss.sonatype.org/content/groups/public/org/codehaus/plexus/plexus-classworlds/2.4.2/plexus-classworlds-2.4.2.pom
Downloading: https://repo.maven.apache.org/maven2/org/codehaus/plexus/plexus-classworlds/2.4.2/plexus-classworlds-2.4.2.pom
Downloaded: https://repo.maven.apache.org/maven2/org/codehaus/plexus/plexus-classworlds/2.4.2/plexus-classworlds-2.4.2.pom (4 KB at 131.8 KB/sec)
Downloading: https://oss.sonatype.org/content/groups/public/org/codehaus/plexus/plexus-interpolation/1.16/plexus-interpolation-1.16.pom
Downloading: https://repo.maven.apache.org/maven2/org/codehaus/plexus/plexus-interpolation/1.16/plexus-interpolation-1.16.pom
Downloaded: https://repo.maven.apache.org/maven2/org/codehaus/plexus/plexus-interpolation/1.16/plexus-interpolation-1.16.pom (2 KB at 38.6 KB/sec)
Downloading: https://oss.sonatype.org/content/groups/public/org/eclipse/aether/aether-api/0.9.0.M2/aether-api-0.9.0.M2.pom
Downloaded: https://oss.sonatype.org/content/groups/public/org/eclipse/aether/aether-api/0.9.0.M2/aether-api-0.9.0.M2.pom (0 B at 0.0 KB/sec)
Downloading: https://oss.sonatype.org/content/groups/public/org/codehaus/gmaven/gmaven-adapter-api/2.0/gmaven-adapter-api-2.0.pom
Downloaded: https://oss.sonatype.org/content/groups/public/org/codehaus/gmaven/gmaven-adapter-api/2.0/gmaven-adapter-api-2.0.pom (2 KB at 6.4 KB/sec)
Downloading: https://oss.sonatype.org/content/groups/public/org/codehaus/gmaven/gmaven-adapter-impl/2.0/gmaven-adapter-impl-2.0.pom
Downloaded: https://oss.sonatype.org/content/groups/public/org/codehaus/gmaven/gmaven-adapter-impl/2.0/gmaven-adapter-impl-2.0.pom (3 KB at 10.2 KB/sec)
Downloading: https://oss.sonatype.org/content/groups/public/org/codehaus/groovy/groovy-all/2.1.5/groovy-all-2.1.5.pom
Downloaded: https://oss.sonatype.org/content/groups/public/org/codehaus/groovy/groovy-all/2.1.5/groovy-all-2.1.5.pom (18 KB at 46.9 KB/sec)
Downloading: https://oss.sonatype.org/content/groups/public/org/apache/ant/ant/1.8.4/ant-1.8.4.pom
Downloading: https://repo.maven.apache.org/maven2/org/apache/ant/ant/1.8.4/ant-1.8.4.pom
Downloaded: https://repo.maven.apache.org/maven2/org/apache/ant/ant/1.8.4/ant-1.8.4.pom (10 KB at 349.2 KB/sec)
Downloading: https://oss.sonatype.org/content/groups/public/org/apache/ant/ant-parent/1.8.4/ant-parent-1.8.4.pom
Downloading: https://repo.maven.apache.org/maven2/org/apache/ant/ant-parent/1.8.4/ant-parent-1.8.4.pom
Downloaded: https://repo.maven.apache.org/maven2/org/apache/ant/ant-parent/1.8.4/ant-parent-1.8.4.pom (5 KB at 171.3 KB/sec)
Downloading: https://oss.sonatype.org/content/groups/public/org/apache/ant/ant-launcher/1.8.4/ant-launcher-1.8.4.pom
Downloading: https://repo.maven.apache.org/maven2/org/apache/ant/ant-launcher/1.8.4/ant-launcher-1.8.4.pom
Downloaded: https://repo.maven.apache.org/maven2/org/apache/ant/ant-launcher/1.8.4/ant-launcher-1.8.4.pom (3 KB at 92.2 KB/sec)
Downloading: https://oss.sonatype.org/content/groups/public/jline/jline/1.0/jline-1.0.pom
Downloaded: https://oss.sonatype.org/content/groups/public/jline/jline/1.0/jline-1.0.pom (9 KB at 14.0 KB/sec)
Downloading: https://oss.sonatype.org/content/groups/public/org/sonatype/gossip/gossip-slf4j/1.8/gossip-slf4j-1.8.jar
Downloading: https://oss.sonatype.org/content/groups/public/org/sonatype/gossip/gossip-bootstrap/1.8/gossip-bootstrap-1.8.jar
Downloading: https://oss.sonatype.org/content/groups/public/org/sonatype/gossip/gossip-core/1.8/gossip-core-1.8.jar
Downloading: https://oss.sonatype.org/content/groups/public/org/codehaus/plexus/plexus-classworlds/2.4.2/plexus-classworlds-2.4.2.jar
Downloading: https://oss.sonatype.org/content/groups/public/org/codehaus/plexus/plexus-interpolation/1.16/plexus-interpolation-1.16.jar
Downloading: https://oss.sonatype.org/content/groups/public/org/eclipse/aether/aether-api/0.9.0.M2/aether-api-0.9.0.M2.jar
Downloading: https://oss.sonatype.org/content/groups/public/org/codehaus/gmaven/gmaven-adapter-api/2.0/gmaven-adapter-api-2.0.jar
Downloading: https://oss.sonatype.org/content/groups/public/org/codehaus/gmaven/gmaven-adapter-impl/2.0/gmaven-adapter-impl-2.0.jar
Downloading: https://oss.sonatype.org/content/groups/public/org/codehaus/groovy/groovy-all/2.1.5/groovy-all-2.1.5.jar
Downloading: https://oss.sonatype.org/content/groups/public/org/apache/ant/ant/1.8.4/ant-1.8.4.jar
Downloaded: https://oss.sonatype.org/content/groups/public/org/eclipse/aether/aether-api/0.9.0.M2/aether-api-0.9.0.M2.jar (0 B at 0.0 KB/sec)
Downloading: https://oss.sonatype.org/content/groups/public/org/apache/ant/ant-launcher/1.8.4/ant-launcher-1.8.4.jar
Downloading: https://oss.sonatype.org/content/groups/public/jline/jline/1.0/jline-1.0.jar
Downloaded:7https://oss.sonatype.org/content/groups/public/org/codehaus/gmaven/gmaven-adapter-api/2.0/gmaven-adapter-api-2.0.jar (7 KB at 6.6 KB/sec)
Downloaded:8https://oss.sonatype.org/content/groups/public/org/codehaus/gmaven/gmaven-adapter-impl/2.0/gmaven-adapter-impl-2.0.jar (16 KB at 13.5 KB/sec)
Downloaded:6https://oss.sonatype.org/content/groups/public/jline/jline/1.0/jline-1.0.jar (90 KB at 56.9 KB/sec)
Downloaded:Bhttps://oss.sonatype.org/content/groups/public/org/codehaus/groovy/groovy-all/2.1.5/groovy-all-2.1.5.jar (6219 KB at 1920.4 KB/sec)
Downloading: https://repo.maven.apache.org/maven2/org/sonatype/gossip/gossip-slf4j/1.8/gossip-slf4j-1.8.jar
Downloading: https://repo.maven.apache.org/maven2/org/sonatype/gossip/gossip-core/1.8/gossip-core-1.8.jar
Downloading: https://repo.maven.apache.org/maven2/org/sonatype/gossip/gossip-bootstrap/1.8/gossip-bootstrap-1.8.jar
Downloading: https://repo.maven.apache.org/maven2/org/codehaus/plexus/plexus-classworlds/2.4.2/plexus-classworlds-2.4.2.jar
Downloading: https://repo.maven.apache.org/maven2/org/codehaus/plexus/plexus-interpolation/1.16/plexus-interpolation-1.16.jar
Downloaded: https://repo.maven.apache.org/maven2/org/sonatype/gossip/gossip-slf4j/1.8/gossip-slf4j-1.8.jar (5 KB at 137.6 KB/sec)
Downloading: https://repo.maven.apache.org/maven2/org/apache/ant/ant/1.8.4/ant-1.8.4.jar
Downloaded:6https://repo.maven.apache.org/maven2/org/sonatype/gossip/gossip-bootstrap/1.8/gossip-bootstrap-1.8.jar (20 KB at 327.0 KB/sec)
Downloading: https://repo.maven.apache.org/maven2/org/apache/ant/ant-launcher/1.8.4/ant-launcher-1.8.4.jar
Downloaded:6https://repo.maven.apache.org/maven2/org/codehaus/plexus/plexus-interpolation/1.16/plexus-interpolation-1.16.jar (60 KB at 880.5 KB/sec)
Downloaded: https://repo.maven.apache.org/maven2/org/codehaus/plexus/plexus-classworlds/2.4.2/plexus-classworlds-2.4.2.jar (46 KB at 664.8 KB/sec)
Downloaded: https://repo.maven.apache.org/maven2/org/sonatype/gossip/gossip-core/1.8/gossip-core-1.8.jar (57 KB at 795.2 KB/sec)
Downloaded: https://repo.maven.apache.org/maven2/org/apache/ant/ant-launcher/1.8.4/ant-launcher-1.8.4.jar (18 KB at 219.5 KB/sec)
Downloaded:Bhttps://repo.maven.apache.org/maven2/org/apache/ant/ant/1.8.4/ant-1.8.4.jar (1897 KB at 5593.6 KB/sec)
[INFO] ------------------------------------------------------------------------
[INFO] BUILD SUCCESS
[INFO] ------------------------------------------------------------------------
[INFO] Total time: 17.584 s
[INFO] Finished at: 2018-08-03T13:05:05+00:00
[INFO] Final Memory: 35M/449M
[INFO] ------------------------------------------------------------------------
+ git commit -m settings.xml
[__rultor faa9a650] settings.xml
 1 file changed, 111 insertions(+)
 create mode 100644 settings.xml
++ git symbolic-ref --short HEAD
+ git push -f heroku __rultor:master
Warning: Permanently added 'heroku.com,50.19.85.132' (RSA) to the list of known hosts.
Counting objects: 51534, done.
Delta compression using up to 12 threads.
Compressing objects: 100% (13283/13283), done.
Writing objects: 100% (51534/51534),26.77MMiB||45.87MMiB/s, done.
Total 51534 (delta 29961), reused 51525 (delta 29957)
remote: Compressing source files... done.K
remote: Building source:K
remote:
remote: -----> Apt app detectedK
remote: -----> Reusing cacheK
remote: -----> Updating apt cachesK
remote:        Hit:1 http://archive.ubuntu.com/ubuntu xenial InReleaseK
remote:        Get:2 http://archive.ubuntu.com/ubuntu xenial-security InRelease [107 kB]K
remote:        Hit:3 http://apt.postgresql.org/pub/repos/apt xenial-pgdg InReleaseK
remote:        Get:4 http://archive.ubuntu.com/ubuntu xenial-updates InRelease [109 kB]K
remote:        Get:5 http://archive.ubuntu.com/ubuntu xenial-updates/main amd64 Packages [1,060 kB]K
remote:        Get:6 http://archive.ubuntu.com/ubuntu xenial-updates/universe amd64 Packages [870 kB]K
remote:        Fetched 2,146 kB in 1s (1,826 kB/s)K
remote:        Reading package lists...K
remote: ls: cannot access '/app/tmp/cache/apt/cache/archives/*.deb': No such file or directoryK
remote: -----> Writing profile scriptK
remote: -----> Rewrite package-config filesK
remote: -----> Java app detectedK
remote: -----> Installing JDK 1.8... doneK
remote: -----> Installing Maven 3.3.9... doneK
remote: -----> Executing: mvn -DskipTests clean dependency:list installK
remote:        [INFO] Scanning for projects...K
remote:        [INFO]                                                                         K
remote:        [INFO] ------------------------------------------------------------------------K
remote:        [INFO] Building farm 0.28.15K
remote:        [INFO] ------------------------------------------------------------------------K
remote:        [WARNING] The artifact org.hibernate:hibernate-validator:jar:6.0.2.Final has been relocated to org.hibernate.validator:hibernate-validator:jar:6.0.2.FinalK
remote:        [INFO] K
remote:        [INFO] --- maven-clean-plugin:3.0.0:clean (default-clean) @ farm ---K
remote:        [INFO] K
remote:        [INFO] --- maven-dependency-plugin:2.10:list (default-cli) @ farm ---K
remote:        [INFO] K
remote:        [INFO] --- maven-enforcer-plugin:1.4.1:enforce (enforce-maven) @ farm ---K
remote:        [INFO] K
remote:        [INFO] --- buildnumber-maven-plugin:1.4:create (jcabi-build-number) @ farm ---K
remote:        [INFO] ShortRevision tag detected. The value is '7'.K
remote:        [INFO] Executing: /bin/sh -c cd '/tmp/build_b5d9652d5381c44cb2c6ae2e2cc21afb' && 'git' 'rev-parse' '--verify' '--short=7' 'HEAD'K
remote:        [INFO] Working directory: /tmp/build_b5d9652d5381c44cb2c6ae2e2cc21afbK
remote:        [INFO] Storing buildNumber: null at timestamp: 2018-08-03T13:05:31K
remote:        [WARNING] Cannot get the branch information from the git repository: K
remote:        Detecting the current branch failed: fatal: Not a git repository (or any parent up to mount point /tmp)K
remote:        Stopping at filesystem boundary (GIT_DISCOVERY_ACROSS_FILESYSTEM not set).K
remote:        K
remote:        [INFO] ShortRevision tag detected. The value is '7'.K
remote:        [INFO] Executing: /bin/sh -c cd '/tmp/build_b5d9652d5381c44cb2c6ae2e2cc21afb' && 'git' 'rev-parse' '--verify' '--short=7' 'HEAD'K
remote:        [INFO] Working directory: /tmp/build_b5d9652d5381c44cb2c6ae2e2cc21afbK
remote:        [INFO] Storing buildScmBranch: UNKNOWN_BRANCHK
remote:        [INFO] K
remote:        [INFO] --- buildnumber-maven-plugin:1.4:create-timestamp (jcabi-build-number) @ farm ---K
remote:        [INFO] K
remote:        [INFO] --- sass-maven-plugin:2.25:update-stylesheets (generate-css) @ farm ---K
remote:        [INFO] Checked 1 files for /tmp/build_b5d9652d5381c44cb2c6ae2e2cc21afb/src/main/scssK
remote:        [INFO] Checked 0 filtered (**/*.css) files for /tmp/build_b5d9652d5381c44cb2c6ae2e2cc21afb/target/cssK
remote:        [INFO] Compiling Sass templatesK
remote:        [INFO] No resource element was specified, using short configuration.K
remote:        [INFO] Queueing Sass template for compile: /tmp/build_b5d9652d5381c44cb2c6ae2e2cc21afb/src/main/scss => /tmp/build_b5d9652d5381c44cb2c6ae2e2cc21afb/target/cssK
remote:        [INFO]     >> /tmp/build_b5d9652d5381c44cb2c6ae2e2cc21afb/src/main/scss/main.scss => /tmp/build_b5d9652d5381c44cb2c6ae2e2cc21afb/target/css/main.cssK
remote:        [INFO] K
remote:        [INFO] --- htmlcompressor-maven-plugin:1.3:xml (compress-xsl) @ farm ---K
remote:        [INFO] Compressing /tmp/build_b5d9652d5381c44cb2c6ae2e2cc21afb/src/main/resources/xslK
remote:        [INFO] XML compression completed.K
remote:        [INFO] K
remote:        [INFO] --- maven-resources-plugin:3.0.1:resources (default-resources) @ farm ---K
remote:        [INFO] Using 'UTF-8' encoding to copy filtered resources.K
remote:        [INFO] Copying 62 resourcesK
remote:        [INFO] K
remote:        [INFO] --- minify-maven-plugin:1.7.2:minify (minify-css) @ farm ---K
remote:        [INFO] Starting CSS task:K
remote:        [INFO] Skipping the merge step...K
remote:        [INFO] Creating the minified file [main.css].K
remote:        [INFO] Uncompressed size: 1505 bytes.K
remote:        [INFO] Compressed size: 1165 bytes minified (554 bytes gzipped).K
remote:        [INFO] K
remote:        [INFO] Starting JavaScript task:K
remote:        [INFO] K
remote:        [INFO] --- maven-compiler-plugin:3.6.0:compile (default-compile) @ farm ---K
remote:        [INFO] Changes detected - recompiling the module!K
remote:        [INFO] Compiling 349 source files to /tmp/build_b5d9652d5381c44cb2c6ae2e2cc21afb/target/classesK
remote:        [INFO] K
remote:        [INFO] --- gmavenplus-plugin:1.5:compile (jcabi-groovy) @ farm ---K
remote:        [INFO] Using Groovy 2.4.15 to perform compile.K
remote:        [INFO] Compiled 186 files.K
remote:        [INFO] K
remote:        [INFO] --- maven-resources-plugin:3.0.1:testResources (default-testResources) @ farm ---K
remote:        [INFO] Using 'UTF-8' encoding to copy filtered resources.K
remote:        [INFO] Copying 353 resourcesK
remote:        [INFO] K
remote:        [INFO] --- maven-compiler-plugin:3.6.0:testCompile (default-testCompile) @ farm ---K
remote:        [INFO] Changes detected - recompiling the module!K
remote:        [INFO] Compiling 164 source files to /tmp/build_b5d9652d5381c44cb2c6ae2e2cc21afb/target/test-classesK
remote:        [INFO] K
remote:        [INFO] --- gmavenplus-plugin:1.5:testCompile (jcabi-groovy) @ farm ---K
remote:        [INFO] No sources specified for compilation.  Skipping.K
remote:        [INFO] K
remote:        [INFO] --- maven-surefire-plugin:2.19.1:test (default-test) @ farm ---K
remote:        [INFO] Tests are skipped.K
remote:        [INFO] K
remote:        [INFO] --- jcabi-maven-plugin:0.14.1:versionalize (jcabi-versionalize-packages) @ farm ---K
remote:        [INFO] jcabi-aspects 0.18/55a5c13 started new daemon thread jcabi-loggable for watching of @Loggable annotated methodsK
remote:        [INFO] Versionalizing /tmp/build_b5d9652d5381c44cb2c6ae2e2cc21afb/target/classes directoryK
remote:        [0;37mINFOm] org.hibernate.validator.internal.util.Version: HV000001: Hibernate Validator 5.1.2.FinalK
remote:        [INFO] JSR-303 validator org.hibernate.validator.internal.engine.ValidatorImpl instantiated by jcabi-aspects 0.18/55a5c13
remote:        [INFO] File /tmp/build_b5d9652d5381c44cb2c6ae2e2cc21afb/target/classes/com/zerocracy/com-zerocracy-farm-jar.txt addedK
remote:        [INFO] File /tmp/build_b5d9652d5381c44cb2c6ae2e2cc21afb/target/classes/com/zerocracy/farm/com-zerocracy-farm-jar.txt addedK
remote:        [INFO] File /tmp/build_b5d9652d5381c44cb2c6ae2e2cc21afb/target/classes/com/zerocracy/farm/props/com-zerocracy-farm-jar.txt addedK
remote:        [INFO] File /tmp/build_b5d9652d5381c44cb2c6ae2e2cc21afb/target/classes/com/zerocracy/farm/footprint/com-zerocracy-farm-jar.txt addedK
remote:        [INFO] File /tmp/build_b5d9652d5381c44cb2c6ae2e2cc21afb/target/classes/com/zerocracy/farm/strict/com-zerocracy-farm-jar.txt addedK
remote:        [INFO] File /tmp/build_b5d9652d5381c44cb2c6ae2e2cc21afb/target/classes/com/zerocracy/farm/reactive/com-zerocracy-farm-jar.txt addedK
remote:        [INFO] File /tmp/build_b5d9652d5381c44cb2c6ae2e2cc21afb/target/classes/com/zerocracy/farm/spy/com-zerocracy-farm-jar.txt addedK
remote:        [INFO] File /tmp/build_b5d9652d5381c44cb2c6ae2e2cc21afb/target/classes/com/zerocracy/farm/guts/com-zerocracy-farm-jar.txt addedK
remote:        [INFO] File /tmp/build_b5d9652d5381c44cb2c6ae2e2cc21afb/target/classes/com/zerocracy/farm/ruled/com-zerocracy-farm-jar.txt addedK
remote:        [INFO] File /tmp/build_b5d9652d5381c44cb2c6ae2e2cc21afb/target/classes/com/zerocracy/farm/fake/com-zerocracy-farm-jar.txt addedK
remote:        [INFO] File /tmp/build_b5d9652d5381c44cb2c6ae2e2cc21afb/target/classes/com/zerocracy/farm/sync/com-zerocracy-farm-jar.txt addedK
remote:        [INFO] File /tmp/build_b5d9652d5381c44cb2c6ae2e2cc21afb/target/classes/com/zerocracy/claims/com-zerocracy-farm-jar.txt addedK
remote:        [INFO] File /tmp/build_b5d9652d5381c44cb2c6ae2e2cc21afb/target/classes/com/zerocracy/claims/proc/com-zerocracy-farm-jar.txt addedK
remote:        [INFO] File /tmp/build_b5d9652d5381c44cb2c6ae2e2cc21afb/target/classes/com/zerocracy/pm/com-zerocracy-farm-jar.txt addedK
remote:        [INFO] File /tmp/build_b5d9652d5381c44cb2c6ae2e2cc21afb/target/classes/com/zerocracy/pm/qa/com-zerocracy-farm-jar.txt addedK
remote:        [INFO] File /tmp/build_b5d9652d5381c44cb2c6ae2e2cc21afb/target/classes/com/zerocracy/pm/time/com-zerocracy-farm-jar.txt addedK
remote:        [INFO] File /tmp/build_b5d9652d5381c44cb2c6ae2e2cc21afb/target/classes/com/zerocracy/pm/cost/com-zerocracy-farm-jar.txt addedK
remote:        [INFO] File /tmp/build_b5d9652d5381c44cb2c6ae2e2cc21afb/target/classes/com/zerocracy/pm/staff/com-zerocracy-farm-jar.txt addedK
remote:        [INFO] File /tmp/build_b5d9652d5381c44cb2c6ae2e2cc21afb/target/classes/com/zerocracy/pm/staff/ranks/com-zerocracy-farm-jar.txt addedK
remote:        [INFO] File /tmp/build_b5d9652d5381c44cb2c6ae2e2cc21afb/target/classes/com/zerocracy/pm/staff/votes/com-zerocracy-farm-jar.txt addedK
remote:        [INFO] File /tmp/build_b5d9652d5381c44cb2c6ae2e2cc21afb/target/classes/com/zerocracy/pm/in/com-zerocracy-farm-jar.txt addedK
remote:        [INFO] File /tmp/build_b5d9652d5381c44cb2c6ae2e2cc21afb/target/classes/com/zerocracy/pm/scope/com-zerocracy-farm-jar.txt addedK
remote:        [INFO] File /tmp/build_b5d9652d5381c44cb2c6ae2e2cc21afb/target/classes/com/zerocracy/entry/com-zerocracy-farm-jar.txt addedK
remote:        [INFO] File /tmp/build_b5d9652d5381c44cb2c6ae2e2cc21afb/target/classes/com/zerocracy/tools/com-zerocracy-farm-jar.txt addedK
remote:        [INFO] File /tmp/build_b5d9652d5381c44cb2c6ae2e2cc21afb/target/classes/com/zerocracy/tk/com-zerocracy-farm-jar.txt addedK
remote:        [INFO] File /tmp/build_b5d9652d5381c44cb2c6ae2e2cc21afb/target/classes/com/zerocracy/tk/project/com-zerocracy-farm-jar.txt addedK
remote:        [INFO] File /tmp/build_b5d9652d5381c44cb2c6ae2e2cc21afb/target/classes/com/zerocracy/tk/project/reports/com-zerocracy-farm-jar.txt addedK
remote:        [INFO] File /tmp/build_b5d9652d5381c44cb2c6ae2e2cc21afb/target/classes/com/zerocracy/tk/profile/com-zerocracy-farm-jar.txt addedK
remote:        [INFO] File /tmp/build_b5d9652d5381c44cb2c6ae2e2cc21afb/target/classes/com/zerocracy/tk/rfp/com-zerocracy-farm-jar.txt addedK
remote:        [INFO] File /tmp/build_b5d9652d5381c44cb2c6ae2e2cc21afb/target/classes/com/zerocracy/pmo/com-zerocracy-farm-jar.txt addedK
remote:        [INFO] File /tmp/build_b5d9652d5381c44cb2c6ae2e2cc21afb/target/classes/com/zerocracy/pmo/banks/com-zerocracy-farm-jar.txt addedK
remote:        [INFO] File /tmp/build_b5d9652d5381c44cb2c6ae2e2cc21afb/target/classes/com/zerocracy/pmo/recharge/com-zerocracy-farm-jar.txt addedK
remote:        [INFO] File /tmp/build_b5d9652d5381c44cb2c6ae2e2cc21afb/target/classes/com/zerocracy/radars/com-zerocracy-farm-jar.txt addedK
remote:        [INFO] File /tmp/build_b5d9652d5381c44cb2c6ae2e2cc21afb/target/classes/com/zerocracy/radars/slack/com-zerocracy-farm-jar.txt addedK
remote:        [INFO] File /tmp/build_b5d9652d5381c44cb2c6ae2e2cc21afb/target/classes/com/zerocracy/radars/gitlab/com-zerocracy-farm-jar.txt addedK
remote:        [INFO] File /tmp/build_b5d9652d5381c44cb2c6ae2e2cc21afb/target/classes/com/zerocracy/radars/viber/com-zerocracy-farm-jar.txt addedK
remote:        [INFO] File /tmp/build_b5d9652d5381c44cb2c6ae2e2cc21afb/target/classes/com/zerocracy/radars/github/com-zerocracy-farm-jar.txt addedK
remote:        [INFO] File /tmp/build_b5d9652d5381c44cb2c6ae2e2cc21afb/target/classes/com/zerocracy/radars/telegram/com-zerocracy-farm-jar.txt addedK
remote:        [INFO] File /tmp/build_b5d9652d5381c44cb2c6ae2e2cc21afb/target/classes/com/zerocracy/cash/com-zerocracy-farm-jar.txt addedK
remote:        [INFO] K
remote:        [INFO] --- maven-jar-plugin:3.0.2:jar (default-jar) @ farm ---K
remote:        [INFO] Building jar: /tmp/build_b5d9652d5381c44cb2c6ae2e2cc21afb/target/farm.jarK
remote:        [INFO] K
remote:        [INFO] --- maven-dependency-plugin:2.10:copy-dependencies (copy-dependencies-for-heroku) @ farm ---K
remote:        [INFO] Copying de.flapdoodle.embed.process-2.0.2.jar to /tmp/build_b5d9652d5381c44cb2c6ae2e2cc21afb/target/deps/de.flapdoodle.embed.process-2.0.2.jarK
remote:        [INFO] Copying bcprov-jdk15on-1.57.jar to /tmp/build_b5d9652d5381c44cb2c6ae2e2cc21afb/target/deps/bcprov-jdk15on-1.57.jarK
remote:        [INFO] Copying protobuf-java-2.5.0.jar to /tmp/build_b5d9652d5381c44cb2c6ae2e2cc21afb/target/deps/protobuf-java-2.5.0.jar
remote:        [INFO] Copying aopalliance-1.0.jar to /tmp/build_b5d9652d5381c44cb2c6ae2e2cc21afb/target/deps/aopalliance-1.0.jarK
remote:        [INFO] Copying quartz-2.2.1.jar to /tmp/build_b5d9652d5381c44cb2c6ae2e2cc21afb/target/deps/quartz-2.2.1.jarK
remote:        [INFO] Copying javax.json-1.1.jar to /tmp/build_b5d9652d5381c44cb2c6ae2e2cc21afb/target/deps/javax.json-1.1.jarK
remote:        [INFO] Copying joda-time-2.8.1.jar to /tmp/build_b5d9652d5381c44cb2c6ae2e2cc21afb/target/deps/joda-time-2.8.1.jarK
remote:        [INFO] Copying mongobee-0.13.jar to /tmp/build_b5d9652d5381c44cb2c6ae2e2cc21afb/target/deps/mongobee-0.13.jarK
remote:        [INFO] Copying jersey-common-2.26.jar to /tmp/build_b5d9652d5381c44cb2c6ae2e2cc21afb/target/deps/jersey-common-2.26.jarK
remote:        [INFO] Copying jackson-jaxrs-base-2.8.7.jar to /tmp/build_b5d9652d5381c44cb2c6ae2e2cc21afb/target/deps/jackson-jaxrs-base-2.8.7.jarK
remote:        [INFO] Copying hibernate-validator-6.0.2.Final.jar to /tmp/build_b5d9652d5381c44cb2c6ae2e2cc21afb/target/deps/hibernate-validator-6.0.2.Final.jarK
remote:        [INFO] Copying javassist-3.21.0-GA.jar to /tmp/build_b5d9652d5381c44cb2c6ae2e2cc21afb/target/deps/javassist-3.21.0-GA.jarK
remote:        [INFO] Copying jaxb-api-2.3.0.jar to /tmp/build_b5d9652d5381c44cb2c6ae2e2cc21afb/target/deps/jaxb-api-2.3.0.jarK
remote:        [INFO] Copying aws-java-sdk-core-1.11.211.jar to /tmp/build_b5d9652d5381c44cb2c6ae2e2cc21afb/target/deps/aws-java-sdk-core-1.11.211.jarK
remote:        [INFO] Copying httpcore-4.4.6.jar to /tmp/build_b5d9652d5381c44cb2c6ae2e2cc21afb/target/deps/httpcore-4.4.6.jarK
remote:        [INFO] Copying jcabi-github-0.41.jar to /tmp/build_b5d9652d5381c44cb2c6ae2e2cc21afb/target/deps/jcabi-github-0.41.jarK
remote:        [INFO] Copying jackson-databind-2.7.9.1.jar to /tmp/build_b5d9652d5381c44cb2c6ae2e2cc21afb/target/deps/jackson-databind-2.7.9.1.jarK
remote:        [INFO] Copying httpclient-4.4.jar to /tmp/build_b5d9652d5381c44cb2c6ae2e2cc21afb/target/deps/httpclient-4.4.jarK
remote:        [INFO] Copying simpleslackapi-1.0.0.jar to /tmp/build_b5d9652d5381c44cb2c6ae2e2cc21afb/target/deps/simpleslackapi-1.0.0.jarK
remote:        [INFO] Copying threetenbp-1.3.1.jar to /tmp/build_b5d9652d5381c44cb2c6ae2e2cc21afb/target/deps/threetenbp-1.3.1.jarK
remote:        [INFO] Copying twitter4j-core-4.0.6.jar to /tmp/build_b5d9652d5381c44cb2c6ae2e2cc21afb/target/deps/twitter4j-core-4.0.6.jarK
remote:        [INFO] Copying cactoos-cache-0.1.3.jar to /tmp/build_b5d9652d5381c44cb2c6ae2e2cc21afb/target/deps/cactoos-cache-0.1.3.jarK
remote:        [INFO] Copying slf4j-log4j12-1.8.0-alpha2.jar to /tmp/build_b5d9652d5381c44cb2c6ae2e2cc21afb/target/deps/slf4j-log4j12-1.8.0-alpha2.jarK
remote:        [INFO] Copying mongodb-driver-3.8.0.jar to /tmp/build_b5d9652d5381c44cb2c6ae2e2cc21afb/target/deps/mongodb-driver-3.8.0.jarK
remote:        [INFO] Copying opencsv-2.0.jar to /tmp/build_b5d9652d5381c44cb2c6ae2e2cc21afb/target/deps/opencsv-2.0.jarK
remote:        [INFO] Copying joda-money-0.9.1.jar to /tmp/build_b5d9652d5381c44cb2c6ae2e2cc21afb/target/deps/joda-money-0.9.1.jarK
remote:        [INFO] Copying jersey-client-2.26.jar to /tmp/build_b5d9652d5381c44cb2c6ae2e2cc21afb/target/deps/jersey-client-2.26.jarK
remote:        [INFO] Copying jsr305-1.3.9.jar to /tmp/build_b5d9652d5381c44cb2c6ae2e2cc21afb/target/deps/jsr305-1.3.9.jarK
remote:        [INFO] Copying c3p0-0.9.1.1.jar to /tmp/build_b5d9652d5381c44cb2c6ae2e2cc21afb/target/deps/c3p0-0.9.1.1.jarK
remote:        [INFO] Copying bson-3.8.0.jar to /tmp/build_b5d9652d5381c44cb2c6ae2e2cc21afb/target/deps/bson-3.8.0.jarK
remote:        [INFO] Copying jaxb-core-2.2.11.jar to /tmp/build_b5d9652d5381c44cb2c6ae2e2cc21afb/target/deps/jaxb-core-2.2.11.jarK
remote:        [INFO] Copying commons-text-1.1.jar to /tmp/build_b5d9652d5381c44cb2c6ae2e2cc21afb/target/deps/commons-text-1.1.jarK
remote:        [INFO] Copying istack-commons-runtime-2.21.jar to /tmp/build_b5d9652d5381c44cb2c6ae2e2cc21afb/target/deps/istack-commons-runtime-2.21.jarK
remote:        [INFO] Copying coinbase-java-1.10.0.jar to /tmp/build_b5d9652d5381c44cb2c6ae2e2cc21afb/target/deps/coinbase-java-1.10.0.jarK
remote:        [INFO] Copying telegrambots-meta-3.6.jar to /tmp/build_b5d9652d5381c44cb2c6ae2e2cc21afb/target/deps/telegrambots-meta-3.6.jarK
remote:        [INFO] Copying jcabi-dynamo-0.21.4.jar to /tmp/build_b5d9652d5381c44cb2c6ae2e2cc21afb/target/deps/jcabi-dynamo-0.21.4.jarK
remote:        [INFO] Copying antlr-runtime-3.5.2.jar to /tmp/build_b5d9652d5381c44cb2c6ae2e2cc21afb/target/deps/antlr-runtime-3.5.2.jarK
remote:        [INFO] Copying error_prone_annotations-2.0.18.jar to /tmp/build_b5d9652d5381c44cb2c6ae2e2cc21afb/target/deps/error_prone_annotations-2.0.18.jarK
remote:        [INFO] Copying commons-codec-1.10.jar to /tmp/build_b5d9652d5381c44cb2c6ae2e2cc21afb/target/deps/commons-codec-1.10.jarK
remote:        [INFO] Copying yoti-sdk-impl-1.3.jar to /tmp/build_b5d9652d5381c44cb2c6ae2e2cc21afb/target/deps/yoti-sdk-impl-1.3.jarK
remote:        [INFO] Copying jcabi-matchers-1.4.jar to /tmp/build_b5d9652d5381c44cb2c6ae2e2cc21afb/target/deps/jcabi-matchers-1.4.jarK
remote:        [INFO] Copying stax-ex-1.7.7.jar to /tmp/build_b5d9652d5381c44cb2c6ae2e2cc21afb/target/deps/stax-ex-1.7.7.jarK
remote:        [INFO] Copying jcabi-http-1.17.1.jar to /tmp/build_b5d9652d5381c44cb2c6ae2e2cc21afb/target/deps/jcabi-http-1.17.1.jarK
remote:        [INFO] Copying javax.inject-1.jar to /tmp/build_b5d9652d5381c44cb2c6ae2e2cc21afb/target/deps/javax.inject-1.jarK
remote:        [INFO] Copying commons-compress-1.10.jar to /tmp/build_b5d9652d5381c44cb2c6ae2e2cc21afb/target/deps/commons-compress-1.10.jarK
remote:        [INFO] Copying osgi-resource-locator-1.0.1.jar to /tmp/build_b5d9652d5381c44cb2c6ae2e2cc21afb/target/deps/osgi-resource-locator-1.0.1.jarK
remote:        [INFO] Copying jersey-entity-filtering-2.25.1.jar to /tmp/build_b5d9652d5381c44cb2c6ae2e2cc21afb/target/deps/jersey-entity-filtering-2.25.1.jarK
remote:        [INFO] Copying aws-java-sdk-dynamodb-1.11.211.jar to /tmp/build_b5d9652d5381c44cb2c6ae2e2cc21afb/target/deps/aws-java-sdk-dynamodb-1.11.211.jarK
remote:        [INFO] Copying spring-data-mongodb-1.6.1.RELEASE.jar to /tmp/build_b5d9652d5381c44cb2c6ae2e2cc21afb/target/deps/spring-data-mongodb-1.6.1.RELEASE.jarK
remote:        [INFO] Copying spring-tx-4.0.7.RELEASE.jar to /tmp/build_b5d9652d5381c44cb2c6ae2e2cc21afb/target/deps/spring-tx-4.0.7.RELEASE.jarK
remote:        [INFO] Copying jcabi-aspects-0.22.6.jar to /tmp/build_b5d9652d5381c44cb2c6ae2e2cc21afb/target/deps/jcabi-aspects-0.22.6.jarK
remote:        [INFO] Copying stripe-java-5.27.0.jar to /tmp/build_b5d9652d5381c44cb2c6ae2e2cc21afb/target/deps/stripe-java-5.27.0.jarK
remote:        [INFO] Copying aws-java-sdk-kms-1.11.211.jar to /tmp/build_b5d9652d5381c44cb2c6ae2e2cc21afb/target/deps/aws-java-sdk-kms-1.11.211.jarK
remote:        [INFO] Copying reflections-0.9.11.jar to /tmp/build_b5d9652d5381c44cb2c6ae2e2cc21afb/target/deps/reflections-0.9.11.jarK
remote:        [INFO] Copying commons-lang3-3.6.jar to /tmp/build_b5d9652d5381c44cb2c6ae2e2cc21afb/target/deps/commons-lang3-3.6.jarK
remote:        [INFO] Copying de.flapdoodle.embed.mongo-2.0.3.jar to /tmp/build_b5d9652d5381c44cb2c6ae2e2cc21afb/target/deps/de.flapdoodle.embed.mongo-2.0.3.jarK
remote:        [INFO] Copying el-impl-2.2.1-b05.jar to /tmp/build_b5d9652d5381c44cb2c6ae2e2cc21afb/target/deps/el-impl-2.2.1-b05.jarK
remote:        [INFO] Copying jboss-logging-3.3.0.Final.jar to /tmp/build_b5d9652d5381c44cb2c6ae2e2cc21afb/target/deps/jboss-logging-3.3.0.Final.jarK
remote:        [INFO] Copying jackson-jaxrs-json-provider-2.8.7.jar to /tmp/build_b5d9652d5381c44cb2c6ae2e2cc21afb/target/deps/jackson-jaxrs-json-provider-2.8.7.jarK
remote:        [INFO] Copying cactoos-0.29.jar to /tmp/build_b5d9652d5381c44cb2c6ae2e2cc21afb/target/deps/cactoos-0.29.jarK
remote:        [INFO] Copying bcpkix-jdk15on-1.57.jar to /tmp/build_b5d9652d5381c44cb2c6ae2e2cc21afb/target/deps/bcpkix-jdk15on-1.57.jarK
remote:        [INFO] Copying guava-23.1-jre.jar to /tmp/build_b5d9652d5381c44cb2c6ae2e2cc21afb/target/deps/guava-23.1-jre.jarK
remote:        [INFO] Copying paypal-core-1.7.2.jar to /tmp/build_b5d9652d5381c44cb2c6ae2e2cc21afb/target/deps/paypal-core-1.7.2.jarK
remote:        [INFO] Copying jackson-annotations-2.8.0.jar to /tmp/build_b5d9652d5381c44cb2c6ae2e2cc21afb/target/deps/jackson-annotations-2.8.0.jarK
remote:        [INFO] Copying guice-4.1.0.jar to /tmp/build_b5d9652d5381c44cb2c6ae2e2cc21afb/target/deps/guice-4.1.0.jarK
remote:        [INFO] Copying log4j-1.2.17.jar to /tmp/build_b5d9652d5381c44cb2c6ae2e2cc21afb/target/deps/log4j-1.2.17.jarK
remote:        [INFO] Copying el-api-2.2.1-b04.jar to /tmp/build_b5d9652d5381c44cb2c6ae2e2cc21afb/target/deps/el-api-2.2.1-b04.jarK
remote:        [INFO] Copying jaxb-runtime-2.2.11.jar to /tmp/build_b5d9652d5381c44cb2c6ae2e2cc21afb/target/deps/jaxb-runtime-2.2.11.jarK
remote:        [INFO] Copying sentry-log4j-1.5.5.jar to /tmp/build_b5d9652d5381c44cb2c6ae2e2cc21afb/target/deps/sentry-log4j-1.5.5.jarK
remote:        [INFO] Copying takes-1.11.2.jar to /tmp/build_b5d9652d5381c44cb2c6ae2e2cc21afb/target/deps/takes-1.11.2.jarK
remote:        [INFO] Copying hamcrest-library-1.3.jar to /tmp/build_b5d9652d5381c44cb2c6ae2e2cc21afb/target/deps/hamcrest-library-1.3.jarK
remote:        [INFO] Copying animal-sniffer-annotations-1.14.jar to /tmp/build_b5d9652d5381c44cb2c6ae2e2cc21afb/target/deps/animal-sniffer-annotations-1.14.jarK
remote:        [INFO] Copying classmate-1.3.1.jar to /tmp/build_b5d9652d5381c44cb2c6ae2e2cc21afb/target/deps/classmate-1.3.1.jarK
remote:        [INFO] Copying javax.ws.rs-api-2.1.jar to /tmp/build_b5d9652d5381c44cb2c6ae2e2cc21afb/target/deps/javax.ws.rs-api-2.1.jarK
remote:        [INFO] Copying commons-lang-2.4.jar to /tmp/build_b5d9652d5381c44cb2c6ae2e2cc21afb/target/deps/commons-lang-2.4.jarK
remote:        [INFO] Copying jcabi-s3-0.18.jar to /tmp/build_b5d9652d5381c44cb2c6ae2e2cc21afb/target/deps/jcabi-s3-0.18.jarK
remote:        [INFO] Copying sentry-1.5.5.jar to /tmp/build_b5d9652d5381c44cb2c6ae2e2cc21afb/target/deps/sentry-1.5.5.jarK
remote:        [INFO] Copying jersey-server-2.26.jar to /tmp/build_b5d9652d5381c44cb2c6ae2e2cc21afb/target/deps/jersey-server-2.26.jarK
remote:        [INFO] Copying jcabi-log-0.17.3.jar to /tmp/build_b5d9652d5381c44cb2c6ae2e2cc21afb/target/deps/jcabi-log-0.17.3.jarK
remote:        [INFO] Copying jersey-media-json-jackson-2.25.1.jar to /tmp/build_b5d9652d5381c44cb2c6ae2e2cc21afb/target/deps/jersey-media-json-jackson-2.25.1.jarK
remote:        [INFO] Copying jna-4.0.0.jar to /tmp/build_b5d9652d5381c44cb2c6ae2e2cc21afb/target/deps/jna-4.0.0.jarK
remote:        [INFO] Copying jna-platform-4.0.0.jar to /tmp/build_b5d9652d5381c44cb2c6ae2e2cc21afb/target/deps/jna-platform-4.0.0.jarK
remote:        [INFO] Copying Saxon-HE-9.8.0-5.jar to /tmp/build_b5d9652d5381c44cb2c6ae2e2cc21afb/target/deps/Saxon-HE-9.8.0-5.jarK
remote:        [INFO] Copying jackson-core-2.8.7.jar to /tmp/build_b5d9652d5381c44cb2c6ae2e2cc21afb/target/deps/jackson-core-2.8.7.jarK
remote:        [INFO] Copying hamcrest-core-1.3.jar to /tmp/build_b5d9652d5381c44cb2c6ae2e2cc21afb/target/deps/hamcrest-core-1.3.jarK
remote:        [INFO] Copying json-20160810.jar to /tmp/build_b5d9652d5381c44cb2c6ae2e2cc21afb/target/deps/json-20160810.jarK
remote:        [INFO] Copying postgresql-42.2.2.jar to /tmp/build_b5d9652d5381c44cb2c6ae2e2cc21afb/target/deps/postgresql-42.2.2.jarK
remote:        [INFO] Copying jcl-over-slf4j-1.7.7.jar to /tmp/build_b5d9652d5381c44cb2c6ae2e2cc21afb/target/deps/jcl-over-slf4j-1.7.7.jarK
remote:        [INFO] Copying jcabi-manifests-1.1.jar to /tmp/build_b5d9652d5381c44cb2c6ae2e2cc21afb/target/deps/jcabi-manifests-1.1.jarK
remote:        [INFO] Copying telegrambots-3.6.jar to /tmp/build_b5d9652d5381c44cb2c6ae2e2cc21afb/target/deps/telegrambots-3.6.jarK
remote:        [INFO] Copying jackson-datatype-joda-2.4.0.jar to /tmp/build_b5d9652d5381c44cb2c6ae2e2cc21afb/target/deps/jackson-datatype-joda-2.4.0.jarK
remote:        [INFO] Copying tyrus-standalone-client-1.13.1.jar to /tmp/build_b5d9652d5381c44cb2c6ae2e2cc21afb/target/deps/tyrus-standalone-client-1.13.1.jarK
remote:        [INFO] Copying mongodb-driver-core-3.8.0.jar to /tmp/build_b5d9652d5381c44cb2c6ae2e2cc21afb/target/deps/mongodb-driver-core-3.8.0.jarK
remote:        [INFO] Copying gson-2.2.4.jar to /tmp/build_b5d9652d5381c44cb2c6ae2e2cc21afb/target/deps/gson-2.2.4.jarK
remote:        [INFO] Copying aws-java-sdk-s3-1.11.211.jar to /tmp/build_b5d9652d5381c44cb2c6ae2e2cc21afb/target/deps/aws-java-sdk-s3-1.11.211.jarK
remote:        [INFO] Copying jersey-media-jaxb-2.26.jar to /tmp/build_b5d9652d5381c44cb2c6ae2e2cc21afb/target/deps/jersey-media-jaxb-2.26.jarK
remote:        [INFO] Copying spring-expression-4.0.6.RELEASE.jar to /tmp/build_b5d9652d5381c44cb2c6ae2e2cc21afb/target/deps/spring-expression-4.0.6.RELEASE.jarK
remote:        [INFO] Copying jcabi-xml-0.21.4.jar to /tmp/build_b5d9652d5381c44cb2c6ae2e2cc21afb/target/deps/jcabi-xml-0.21.4.jarK
remote:        [INFO] Copying commons-io-2.5.jar to /tmp/build_b5d9652d5381c44cb2c6ae2e2cc21afb/target/deps/commons-io-2.5.jarK
remote:        [INFO] Copying jongo-1.3.0.jar to /tmp/build_b5d9652d5381c44cb2c6ae2e2cc21afb/target/deps/jongo-1.3.0.jarK
remote:        [INFO] Copying xembly-0.22.jar to /tmp/build_b5d9652d5381c44cb2c6ae2e2cc21afb/target/deps/xembly-0.22.jarK
remote:        [INFO] Copying jackson-dataformat-cbor-2.6.7.jar to /tmp/build_b5d9652d5381c44cb2c6ae2e2cc21afb/target/deps/jackson-dataformat-cbor-2.6.7.jarK
remote:        [INFO] Copying j2objc-annotations-1.1.jar to /tmp/build_b5d9652d5381c44cb2c6ae2e2cc21afb/target/deps/j2objc-annotations-1.1.jarK
remote:        [INFO] Copying spring-aop-4.0.6.RELEASE.jar to /tmp/build_b5d9652d5381c44cb2c6ae2e2cc21afb/target/deps/spring-aop-4.0.6.RELEASE.jarK
remote:        [INFO] Copying commons-collections-3.2.1.jar to /tmp/build_b5d9652d5381c44cb2c6ae2e2cc21afb/target/deps/commons-collections-3.2.1.jarK
remote:        [INFO] Copying httpmime-4.4.jar to /tmp/build_b5d9652d5381c44cb2c6ae2e2cc21afb/target/deps/httpmime-4.4.jarK
remote:        [INFO] Copying jackson-module-jaxb-annotations-2.8.7.jar to /tmp/build_b5d9652d5381c44cb2c6ae2e2cc21afb/target/deps/jackson-module-jaxb-annotations-2.8.7.jarK
remote:        [INFO] Copying txw2-2.2.11.jar to /tmp/build_b5d9652d5381c44cb2c6ae2e2cc21afb/target/deps/txw2-2.2.11.jarK
remote:        [INFO] Copying bson4jackson-2.7.0.jar to /tmp/build_b5d9652d5381c44cb2c6ae2e2cc21afb/target/deps/bson4jackson-2.7.0.jarK
remote:        [INFO] Copying spring-context-4.0.6.RELEASE.jar to /tmp/build_b5d9652d5381c44cb2c6ae2e2cc21afb/target/deps/spring-context-4.0.6.RELEASE.jarK
remote:        [INFO] Copying jmespath-java-1.11.211.jar to /tmp/build_b5d9652d5381c44cb2c6ae2e2cc21afb/target/deps/jmespath-java-1.11.211.jarK
remote:        [INFO] Copying adaptivepaymentssdk-2.9.117.jar to /tmp/build_b5d9652d5381c44cb2c6ae2e2cc21afb/target/deps/adaptivepaymentssdk-2.9.117.jarK
remote:        [INFO] Copying javax.annotation-api-1.2.jar to /tmp/build_b5d9652d5381c44cb2c6ae2e2cc21afb/target/deps/javax.annotation-api-1.2.jarK
remote:        [INFO] Copying groovy-all-2.4.15.jar to /tmp/build_b5d9652d5381c44cb2c6ae2e2cc21afb/target/deps/groovy-all-2.4.15.jarK
remote:        [INFO] Copying spring-beans-4.0.6.RELEASE.jar to /tmp/build_b5d9652d5381c44cb2c6ae2e2cc21afb/target/deps/spring-beans-4.0.6.RELEASE.jarK
remote:        [INFO] Copying jcabi-immutable-1.4.jar to /tmp/build_b5d9652d5381c44cb2c6ae2e2cc21afb/target/deps/jcabi-immutable-1.4.jar
remote:        [INFO] Copying spring-data-commons-1.9.1.RELEASE.jar to /tmp/build_b5d9652d5381c44cb2c6ae2e2cc21afb/target/deps/spring-data-commons-1.9.1.RELEASE.jarK
remote:        [INFO] Copying annotations-3.0.1.jar to /tmp/build_b5d9652d5381c44cb2c6ae2e2cc21afb/target/deps/annotations-3.0.1.jarK
remote:        [INFO] Copying slf4j-api-1.7.25.jar to /tmp/build_b5d9652d5381c44cb2c6ae2e2cc21afb/target/deps/slf4j-api-1.7.25.jarK
remote:        [INFO] Copying commons-logging-1.1.3.jar to /tmp/build_b5d9652d5381c44cb2c6ae2e2cc21afb/target/deps/commons-logging-1.1.3.jarK
remote:        [INFO] Copying yoti-sdk-api-1.3.jar to /tmp/build_b5d9652d5381c44cb2c6ae2e2cc21afb/target/deps/yoti-sdk-api-1.3.jarK
remote:        [INFO] Copying aspectjrt-1.8.11.jar to /tmp/build_b5d9652d5381c44cb2c6ae2e2cc21afb/target/deps/aspectjrt-1.8.11.jarK
remote:        [INFO] Copying FastInfoset-1.2.13.jar to /tmp/build_b5d9652d5381c44cb2c6ae2e2cc21afb/target/deps/FastInfoset-1.2.13.jarK
remote:        [INFO] Copying ion-java-1.0.2.jar to /tmp/build_b5d9652d5381c44cb2c6ae2e2cc21afb/target/deps/ion-java-1.0.2.jarK
remote:        [INFO] Copying java-semver-0.9.0.jar to /tmp/build_b5d9652d5381c44cb2c6ae2e2cc21afb/target/deps/java-semver-0.9.0.jarK
remote:        [INFO] Copying spring-core-4.0.6.RELEASE.jar to /tmp/build_b5d9652d5381c44cb2c6ae2e2cc21afb/target/deps/spring-core-4.0.6.RELEASE.jarK
remote:        [INFO] Copying velocity-1.7.jar to /tmp/build_b5d9652d5381c44cb2c6ae2e2cc21afb/target/deps/velocity-1.7.jarK
remote:        [INFO] Copying aws-java-sdk-sqs-1.11.211.jar to /tmp/build_b5d9652d5381c44cb2c6ae2e2cc21afb/target/deps/aws-java-sdk-sqs-1.11.211.jarK
remote:        [INFO] K
remote:        [INFO] --- maven-failsafe-plugin:2.20.1:integration-test (default) @ farm ---K
remote:        [INFO] Tests are skipped.K
remote:        [INFO] K
remote:        [INFO] --- maven-antrun-plugin:1.8:run (default) @ farm ---K
remote:        [INFO] Executing tasksK
remote:        K
remote:        main:K
remote:             [echo] XCOP is not available in PATHK
remote:        [INFO] Executed tasksK
remote:        [INFO] K
remote:        [INFO] --- maven-failsafe-plugin:2.20.1:verify (default) @ farm ---K
remote:        [INFO] Tests are skipped.K
remote:        [INFO] K
remote:        [INFO] --- maven-install-plugin:2.5.2:install (default-install) @ farm ---K
remote:        [INFO] Installing /tmp/build_b5d9652d5381c44cb2c6ae2e2cc21afb/target/farm.jar to /app/tmp/cache/.m2/repository/com/zerocracy/farm/0.28.15/farm-0.28.15.jarK
remote:        [INFO] Installing /tmp/build_b5d9652d5381c44cb2c6ae2e2cc21afb/pom.xml to /app/tmp/cache/.m2/repository/com/zerocracy/farm/0.28.15/farm-0.28.15.pomK
remote:        [INFO] ------------------------------------------------------------------------K
remote:        [INFO] BUILD SUCCESSK
remote:        [INFO] ------------------------------------------------------------------------K
remote:        [INFO] Total time: 40.175 sK
remote:        [INFO] Finished at: 2018-08-03T13:06:07+00:00K
remote:        [INFO] Final Memory: 89M/470MK
remote:        [INFO] ------------------------------------------------------------------------K
remote: -----> Discovering process typesK
remote:        Procfile declares types -> webK
remote:
remote: -----> Compressing...K
remote:        Done: 101.7MK
remote: -----> Launching...K
remote:        Released v1362K
remote:        https://zerocrat.herokuapp.com/ deployed to HerokuK
remote:
remote: Verifying deploy... done.K
To heroku.com:zerocrat.git
 + cbef50d1...faa9a650 __rultor -> master (forced update)
+ git reset HEAD~1
+ curl -f --connect-timeout 15 --retry 5 --retry-delay 30 https://www.0crat.com
  % Total    % Received % Xferd  Average Speed   Time    Time     Time  Current
                                 Dload  Upload   Total   Spent    Left  Speed
100  2323    0  2323    0     0   1455      0 --:--:-- -0:00:01 --:--:--  1455
+ mv /home/r/repo .
++ whoami
+ chown -R root repo
+ '[' -n '' ']'
++ whoami
+ sudo chown -R rultor repo
+ cd repo
+ git checkout __rultor
Already on '__rultor'
+ git tag 0.28.15 -m '0.28.15: tagged by rultor.com'
+ git reset --hard
HEAD is now at f34eeb7 0.28.15
+ git clean -fd
Removing settings.xml
+ git checkout master
Switched to branch 'master'
Your branch is up-to-date with 'origin/master'.
+ git branch -D __rultor
Deleted branch __rultor (was f34eeb7).
+ git push --all origin
Everything up-to-date
+ git push --tags origin
To git@github.com:zerocracy/farm.git
 * [new tag]         0.28.15 -> 0.28.15
container bca5bcab9b6bb41cde6e132d7964a543c41f07be83cce8513a52fbc6703fc36c is dead
Fri Aug  3 15:08:55 CEST 2018