+ set -e
+ set -o pipefail
++ dirname ./run.sh
+ cd .
+ echo 29113
+ echo '1.70.6 5bcc93e7c'
1.70.6 5bcc93e7c
+ date
Sun Feb 27 09:58:49 CET 2022
+ uptime
09:58:49 up 517 days, 19:04, 0 users, load average: 0.84, 0.85, 0.89
+ head=git@github.com:polystat/j2ast.git
+ image=iammaxim/j2eo:latest
+ head_branch=master
+ author=iammaxim
+ tag=0.0.2
+ vars=('--env=head=git@github.com:polystat/j2ast.git' '--env=tag=0.0.2' '--env=scripts=( '\''export '\''\'\'''\''head=git@github.com:polystat/j2ast.git'\''\'\'''\'''\'' '\'';'\'' '\''export '\''\'\'''\''tag=0.0.2'\''\'\'''\'''\'' '\'';'\'' '\''export '\''\'\'''\''head_branch=master'\''\'\'''\'''\'' '\'';'\'' '\''export '\''\'\'''\''author=iammaxim'\''\'\'''\'''\'' '\'';'\'' '\''cp ../gradle.properties .'\'' '\'';'\'' '\''echo "Home dir: $HOME"'\'' '\'';'\'' '\''echo "Current path: $(pwd)"'\'' '\'';'\'' '\''echo "Contents of home dir:"'\'' '\'';'\'' '\''ls -lha /home/r'\'' '\'';'\'' '\''echo "Contents of current dir:"'\'' '\'';'\'' '\''ls -lha'\'' '\'';'\'' '\''echo "Building Gradle project (excluding tests)..."'\'' '\'';'\'' '\''./gradlew build jar publish -x test --info -Dcandidates=false -PmvnPublicationVersion=${tag} -Dsigning.secretKeyRingFile=/home/r/secring.gpg'\'' '\'';'\'' '\''echo "Done."'\'' '\'';'\'' )' '--env=head_branch=master' '--env=author=iammaxim')
+ scripts=('export '\''head=git@github.com:polystat/j2ast.git'\''' ';' 'export '\''tag=0.0.2'\''' ';' 'export '\''head_branch=master'\''' ';' 'export '\''author=iammaxim'\''' ';' 'cp ../gradle.properties .' ';' 'echo "Home dir: $HOME"' ';' 'echo "Current path: $(pwd)"' ';' 'echo "Contents of home dir:"' ';' 'ls -lha /home/r' ';' 'echo "Contents of current dir:"' ';' 'ls -lha' ';' 'echo "Building Gradle project (excluding tests)..."' ';' './gradlew build jar publish -x test --info -Dcandidates=false -PmvnPublicationVersion=${tag} -Dsigning.secretKeyRingFile=/home/r/secring.gpg' ';' 'echo "Done."' ';')
+ directory=
+ container=polystat_j2ast_1
+ as_root=true
+ git --version
git version 2.7.4
+ docker --version
Docker version 17.12.0-ce, build c97c6d6
+ mkdir -p /home/rultor/.ssh
+ echo -e 'Host github.com\n\tStrictHostKeyChecking no\n'
+ chmod 600 /home/rultor/.ssh/config
+ git clone git@github.com:polystat/j2ast.git repo
Cloning into 'repo'...
+ cd repo
+ git config user.email me@rultor.com
+ git config user.name rultor
+ '[' -z 'export '\''head=git@github.com:polystat/j2ast.git'\''' ']'
+ cd ..
+ cat
+ '[' true = true ']'
+ cat
+ chmod a+x entry.sh
+ cat
+ echo 'export '\''head=git@github.com:polystat/j2ast.git'\''' ';' 'export '\''tag=0.0.2'\''' ';' 'export '\''head_branch=master'\''' ';' 'export '\''author=iammaxim'\''' ';' 'cp ../gradle.properties .' ';' 'echo "Home dir: $HOME"' ';' 'echo "Current path: $(pwd)"' ';' 'echo "Contents of home dir:"' ';' 'ls -lha /home/r' ';' 'echo "Contents of current dir:"' ';' 'ls -lha' ';' 'echo "Building Gradle project (excluding tests)..."' ';' './gradlew build jar publish -x test --info -Dcandidates=false -PmvnPublicationVersion=${tag} -Dsigning.secretKeyRingFile=/home/r/secring.gpg' ';' 'echo "Done."' ';'
+ sensitive=()
+ rm -rf .gpg
+ '[' -z 0.0.2 ']'
+ [[ 0.0.2 =~ ^[a-zA-Z0-9\.\-]+$ ]]
+ echo 'tag name is valid: "0.0.2"'
tag name is valid: "0.0.2"
+ cd repo
++ git tag -l 0.0.2
+ '[' ']'
+ export BRANCH_NAME=__rultor
+ BRANCH_NAME=__rultor
++ git show-branch __rultor
++ wc -l
+ '[' 0 -gt 0 ']'
+ git checkout -b __rultor
Switched to a new branch '__rultor'
+ docker_when_possible
+ true
++ uptime
++ sed 's/ /\n/g'
++ tail -n 1
+ load=0.89
++ echo 0.89 '>' 30
++ bc
+ '[' 0 -eq 1 ']'
+ echo 'load average is 0.89, low enough to run a new Docker container'
load average is 0.89, low enough to run a new Docker container
+ break
+ cd ..
+ '[' -n '' ']'
+ use_image=iammaxim/j2eo:latest
+ docker pull iammaxim/j2eo:latest
latest: Pulling from iammaxim/j2eo
Digest: sha256:42af51ff3d3e8899099c15d073b66c6709939f868efb8414a039c16a869deb11
Status: Image is up to date for iammaxim/j2eo:latest
+ docker ps --filter=status=exited
+ grep --quiet '\spolystat_j2ast_1\s*$'
+ ls -al .
total 720
drwx--x--x 3 rultor rultor 4096 Feb 27 09:58 .
drwxrwxrwt 13 root root 684032 Feb 27 09:58 ..
-rw-rw-r-- 1 rultor rultor 444 Feb 27 09:58 end.sh
-rwxrwxr-x 1 rultor rultor 162 Feb 27 09:58 entry.sh
-rw-rw-r-- 1 rultor rultor 42 Feb 27 09:58 gradle.properties
-rw-rw-r-- 1 rultor rultor 6 Feb 27 09:58 pid
-rw-rw-r-- 1 rultor rultor 1192 Feb 27 09:58 pubring.gpg
drwxrwxr-x 7 rultor rultor 4096 Feb 27 09:58 repo
-rwxrwxr-x 1 rultor rultor 5857 Feb 27 09:58 run.sh
-rw-rw-r-- 1 rultor rultor 637 Feb 27 09:58 script.sh
-rw-rw-r-- 1 rultor rultor 2570 Feb 27 09:58 secring.gpg
-rw-rw-r-- 1 rultor rultor 4079 Feb 27 09:58 stdout
++ pwd
++ pwd
+ docker run -t --rm -v /tmp/rultor-Z1xz:/main --env=head=git@github.com:polystat/j2ast.git --env=tag=0.0.2 '--env=scripts=( '\''export '\''\'\'''\''head=git@github.com:polystat/j2ast.git'\''\'\'''\'''\'' '\'';'\'' '\''export '\''\'\'''\''tag=0.0.2'\''\'\'''\'''\'' '\'';'\'' '\''export '\''\'\'''\''head_branch=master'\''\'\'''\'''\'' '\'';'\'' '\''export '\''\'\'''\''author=iammaxim'\''\'\'''\'''\'' '\'';'\'' '\''cp ../gradle.properties .'\'' '\'';'\'' '\''echo "Home dir: $HOME"'\'' '\'';'\'' '\''echo "Current path: $(pwd)"'\'' '\'';'\'' '\''echo "Contents of home dir:"'\'' '\'';'\'' '\''ls -lha /home/r'\'' '\'';'\'' '\''echo "Contents of current dir:"'\'' '\'';'\'' '\''ls -lha'\'' '\'';'\'' '\''echo "Building Gradle project (excluding tests)..."'\'' '\'';'\'' '\''./gradlew build jar publish -x test --info -Dcandidates=false -PmvnPublicationVersion=${tag} -Dsigning.secretKeyRingFile=/home/r/secring.gpg'\'' '\'';'\'' '\''echo "Done."'\'' '\'';'\'' )' --env=head_branch=master --env=author=iammaxim --hostname=docker --privileged --memory=6g --memory-swap=16g --oom-kill-disable --cidfile=/tmp/rultor-Z1xz/cid -w=/main -v /var/run/docker.sock:/var/run/docker.sock --name=polystat_j2ast_1 iammaxim/j2eo:latest /main/entry.sh
+ set -e
+ set -o pipefail
+ mkdir /home/r
+ cp -R ./cid ./end.sh ./entry.sh ./gradle.properties ./pid ./pubring.gpg ./repo ./run.sh ./script.sh ./secring.gpg ./stdout /home/r
+ rm -rf repo
+ chmod a+x /home/r/script.sh
+ /home/r/script.sh
+ set -e
+ set -o pipefail
+ shopt -s expand_aliases
+ alias 'sudo=sudo -i'
+ export HOME=/home/r
+ HOME=/home/r
+ cd /home/r/repo
+ export head=git@github.com:polystat/j2ast.git
+ head=git@github.com:polystat/j2ast.git
+ export tag=0.0.2
+ tag=0.0.2
+ export head_branch=master
+ head_branch=master
+ export author=iammaxim
+ author=iammaxim
+ cp ../gradle.properties .
+ echo 'Home dir: /home/r'
Home dir: /home/r
++ pwd
+ echo 'Current path: /home/r/repo'
Current path: /home/r/repo
+ echo 'Contents of home dir:'
Contents of home dir:
+ ls -lha /home/r
total 60K
drwxr-xr-x 3 root root 4.0K Feb 27 08:58 .
drwxr-xr-x 1 root root 4.0K Feb 27 08:58 ..
-rw-r--r-- 1 root root 64 Feb 27 08:58 cid
-rw-r--r-- 1 root root 444 Feb 27 08:58 end.sh
-rwxr-xr-x 1 root root 162 Feb 27 08:58 entry.sh
-rw-r--r-- 1 root root 42 Feb 27 08:58 gradle.properties
-rw-r--r-- 1 root root 6 Feb 27 08:58 pid
-rw-r--r-- 1 root root 1.2K Feb 27 08:58 pubring.gpg
drwxr-xr-x 7 root root 4.0K Feb 27 08:58 repo
-rwxr-xr-x 1 root root 5.8K Feb 27 08:58 run.sh
-rwxr-xr-x 1 root root 637 Feb 27 08:58 script.sh
-rw-r--r-- 1 root root 2.6K Feb 27 08:58 secring.gpg
-rw-r--r-- 1 root root 6.1K Feb 27 08:58 stdout
+ echo 'Contents of current dir:'
Contents of current dir:
+ ls -lha
total 64K
drwxr-xr-x 7 root root 4.0K Feb 27 08:58 .
drwxr-xr-x 3 root root 4.0K Feb 27 08:58 ..
drwxr-xr-x 4 root root 4.0K Feb 27 08:58 bin
-rw-r--r-- 1 root root 7.3K Feb 27 08:58 build.gradle.kts
drwxr-xr-x 8 root root 4.0K Feb 27 08:58 .git
-rw-r--r-- 1 root root 24 Feb 27 08:58 .gitignore
drwxr-xr-x 3 root root 4.0K Feb 27 08:58 gradle
-rw-r--r-- 1 root root 42 Feb 27 08:58 gradle.properties
-rwxr-xr-x 1 root root 7.9K Feb 27 08:58 gradlew
-rw-r--r-- 1 root root 2.7K Feb 27 08:58 gradlew.bat
-rw-r--r-- 1 root root 659 Feb 27 08:58 .rultor.yml
-rw-r--r-- 1 root root 33 Feb 27 08:58 settings.gradle.kts
drwxr-xr-x 7 root root 4.0K Feb 27 08:58 share
drwxr-xr-x 4 root root 4.0K Feb 27 08:58 src
+ echo 'Building Gradle project (excluding tests)...'
Building Gradle project (excluding tests)...
+ ./gradlew build jar publish -x test --info -Dcandidates=false -PmvnPublicationVersion=0.0.2 -Dsigning.secretKeyRingFile=/home/r/secring.gpg
Downloading https://services.gradle.org/distributions/gradle-7.4-bin.zip
...........10%...........20%...........30%...........40%...........50%...........60%...........70%...........80%...........90%...........100%
Initialized native services in: /root/.gradle/native
Initialized jansi services in: /root/.gradle/native
Welcome to Gradle 7.4!
Here are the highlights of this release:
- Aggregated test and JaCoCo reports
- Marking additional test source directories as tests in IntelliJ
- Support for Adoptium JDKs in Java toolchains
For more details see https://docs.gradle.org/7.4/release-notes.html
Removing 0 daemon stop events from registry
Starting a Gradle Daemon (subsequent builds will be faster)
2A1B1m> Starting Daemonm17D1B2AStarting process 'Gradle build daemon'. Working directory: /root/.gradle/daemon/7.4 Command: /usr/lib/jvm/java-17-openjdk/bin/java --add-opens java.base/java.util=ALL-UNNAMED --add-opens java.base/java.lang=ALL-UNNAMED --add-opens java.base/java.lang.invoke=ALL-UNNAMED --add-opens java.base/java.util=ALL-UNNAMED --add-opens java.prefs/java.util.prefs=ALL-UNNAMED --add-opens java.prefs/java.util.prefs=ALL-UNNAMED --add-opens java.base/java.nio.charset=ALL-UNNAMED --add-opens java.base/java.net=ALL-UNNAMED --add-opens java.base/java.util.concurrent.atomic=ALL-UNNAMED -XX:MaxMetaspaceSize=256m -XX:+HeapDumpOnOutOfMemoryError -Xms256m -Xmx512m -Dfile.encoding=UTF-8 -Duser.country=US -Duser.language=en -Duser.variant -cp /root/.gradle/wrapper/dists/gradle-7.4-bin/c0gwcg53nkjbqw7r0h0umtfvt/gradle-7.4/lib/gradle-launcher-7.4.jar org.gradle.launcher.daemon.bootstrap.GradleDaemon 7.4
Successfully started process 'Gradle build daemon'0K
0K
2A1B1m> Starting Daemonm17D1B2AAn attempt to start the daemon took 0.907 secs.
The client will now receive all logging from the daemon (pid: 68). The daemon log file: /root/.gradle/daemon/7.4/daemon-68.out.log0K
Starting build in new daemon [memory: 512 MiB]
0K
2A1B> IDLE6D1B2AUsing 12 worker leases.
1B0K
2A0K1B> IDLE6D1B2A1m<0;1m-------------> 0% INITIALIZING [86ms]m38D2B2A1m<0;1m-------------> 0% INITIALIZING [186ms]m39D2B2A1m<0;1m-------------> 0% INITIALIZING [286ms]m39D2B2A1m<0;1m-------------> 0% INITIALIZING [386ms]m39D2B2A1m<0;1m-------------> 0% INITIALIZING [486ms]m39D2B2AWatching the file system is configured to be enabled if available0K
1B0K
2A1m<0;1m-------------> 0% INITIALIZING [586ms]m39D1B> IDLE6D1B2ANot watching /home/r/repo since the file system is not supported0K
File system watching is active0K
0K
0K
2A1m<0;1m-------------> 0% INITIALIZING [686ms]m39D1B1m> Evaluating settingsm21D1B2A1m<0;1m-------------> 0% INITIALIZING [786ms]m39D2B2A1m<0;1m-------------> 0% INITIALIZING [886ms]m39D2B2A1m<0;1m-------------> 0% INITIALIZING [986ms]m39D2B2A1m<0;1m-------------> 0% INITIALIZING [1s]m0K36D2B2AStarting Build0K
1B0K
2A1m<0;1m-------------> 0% INITIALIZING [1s]m36D1B1m> Evaluating settingsm21D1B2AGenerating /root/.gradle/caches/7.4/generated-gradle-jars/gradle-api-7.4.jar0K
1B0K
2A1m<0;1m-------------> 0% INITIALIZING [1s]m36D1B1m> Evaluating settings > Generating gradle-api-7.4.jarm53D1B1A1m> Evaluating settings > Generating gradle-api-7.4.jar > Generating 1%m69D1B1A1m> Evaluating settings > Generating gradle-api-7.4.jar > Generating 2%m69D1B1A1m> Evaluating settings > Generating gradle-api-7.4.jar > Generating 3%m69D1B2A1m<0;1m-------------> 0% INITIALIZING [2s]m36D1B1m> Evaluating settings > Generating gradle-api-7.4.jar > Generating 4%m69D1B1A1m> Evaluating settings > Generating gradle-api-7.4.jar > Generating 9%m69D1B1A1m> Evaluating settings > Generating gradle-api-7.4.jar > Generating 10%m70D1B2A1m<0;1m-------------> 0% INITIALIZING [3s]m36D2B1A1m> Evaluating settings > Generating gradle-api-7.4.jar > Generating 13%m70D1B1A1m> Evaluating settings > Generating gradle-api-7.4.jar > Generating 16%m70D1B2A1m<0;1m-------------> 0% INITIALIZING [4s]m36D1B1m> Evaluating settings > Generating gradle-api-7.4.jar > Generating 28%m70D1B1A1m> Evaluating settings > Generating gradle-api-7.4.jar > Generating 31%m70D1B1A1m> Evaluating settings > Generating gradle-api-7.4.jar > Generating 33%m70D1B1A1m> Evaluating settings > Generating gradle-api-7.4.jar > Generating 35%m70D1B1A1m> Evaluating settings > Generating gradle-api-7.4.jar > Generating 36%m70D1B1A1m> Evaluating settings > Generating gradle-api-7.4.jar > Generating 38%m70D1B1A1m> Evaluating settings > Generating gradle-api-7.4.jar > Generating 40%m70D1B2A1m<0;1m-------------> 0% INITIALIZING [5s]m36D1B1m> Evaluating settings > Generating gradle-api-7.4.jar > Generating 41%m70D1B1A1m> Evaluating settings > Generating gradle-api-7.4.jar > Generating 42%m70D1B1A1m> Evaluating settings > Generating gradle-api-7.4.jar > Generating 43%m70D1B1A1m> Evaluating settings > Generating gradle-api-7.4.jar > Generating 47%m70D1B1A1m> Evaluating settings > Generating gradle-api-7.4.jar > Generating 49%m70D1B1A1m> Evaluating settings > Generating gradle-api-7.4.jar > Generating 50%m70D1B1A1m> Evaluating settings > Generating gradle-api-7.4.jar > Generating 51%m70D1B2A1m<0;1m-------------> 0% INITIALIZING [6s]m36D2B1A1m> Evaluating settings > Generating gradle-api-7.4.jar > Generating 55%m70D1B1A1m> Evaluating settings > Generating gradle-api-7.4.jar > Generating 56%m70D1B1A1m> Evaluating settings > Generating gradle-api-7.4.jar > Generating 58%m70D1B1A1m> Evaluating settings > Generating gradle-api-7.4.jar > Generating 60%m70D1B2A1m<0;1m-------------> 0% INITIALIZING [7s]m36D2B1A1m> Evaluating settings > Generating gradle-api-7.4.jar > Generating 61%m70D1B1A1m> Evaluating settings > Generating gradle-api-7.4.jar > Generating 65%m70D1B1A1m> Evaluating settings > Generating gradle-api-7.4.jar > Generating 67%m70D1B1A1m> Evaluating settings > Generating gradle-api-7.4.jar > Generating 69%m70D1B1A1m> Evaluating settings > Generating gradle-api-7.4.jar > Generating 70%m70D1B1A1m> Evaluating settings > Generating gradle-api-7.4.jar > Generating 74%m70D1B1A1m> Evaluating settings > Generating gradle-api-7.4.jar > Generating 76%m70D1B2A1m<0;1m-------------> 0% INITIALIZING [8s]m36D1B1m> Evaluating settings > Generating gradle-api-7.4.jar > Generating 78%m70D1B1A1m> Evaluating settings > Generating gradle-api-7.4.jar > Generating 81%m70D1B1A1m> Evaluating settings > Generating gradle-api-7.4.jar > Generating 83%m70D1B1A1m> Evaluating settings > Generating gradle-api-7.4.jar > Generating 84%m70D1B1A1m> Evaluating settings > Generating gradle-api-7.4.jar > Generating 85%m70D1B1A1m> Evaluating settings > Generating gradle-api-7.4.jar > Generating 86%m70D1B1A1m> Evaluating settings > Generating gradle-api-7.4.jar > Generating 87%m70D1B1A1m> Evaluating settings > Generating gradle-api-7.4.jar > Generating 89%m70D1B2A1m<0;1m-------------> 0% INITIALIZING [9s]m36D1B1m> Evaluating settings > Generating gradle-api-7.4.jar > Generating 90%m70D1B1A1m> Evaluating settings > Generating gradle-api-7.4.jar > Generating 91%m70D1B1A1m> Evaluating settings > Generating gradle-api-7.4.jar > Generating 97%m70D1B1A1m> Evaluating settings > Generating gradle-api-7.4.jar > Generating 98%m70D1B1A1m> Evaluating settings > Generating gradle-api-7.4.jar > Generating 100%m71D1B2A1m<0;1m-------------> 0% INITIALIZING [10s]m37D2B1A1m> Evaluating settings > Generating gradle-kotlin-dsl-extensions-7.4.jarm71D1B2A1m<0;1m-------------> 0% INITIALIZING [11s]m37D2B2A1m<0;1m-------------> 0% INITIALIZING [12s]m37D2B2A1m<0;1m-------------> 0% INITIALIZING [13s]m37D2B1A1m> Evaluating settings > Generating gradle-kotlin-dsl-extensions-7.4.jar 33%m75D1B1A1m> Evaluating settings > Generating gradle-kotlin-dsl-extensions-7.4.jar 66%m75D1B2A1m<0;1m-------------> 0% INITIALIZING [14s]m37D2B2A1m<0;1m-------------> 0% INITIALIZING [15s]m37D2B2A1m<0;1m-------------> 0% INITIALIZING [16s]m37D2B2A1m<0;1m-------------> 0% INITIALIZING [17s]m37D2B2A1m<0;1m-------------> 0% INITIALIZING [18s]m37D2B2A1m<0;1m-------------> 0% INITIALIZING [19s]m37D2B2A1m<0;1m-------------> 0% INITIALIZING [20s]m37D2B2A1m<0;1m-------------> 0% INITIALIZING [21s]m37D2B1A1m> Evaluating settingsm0K21D1B2A1m<0;1m-------------> 0% INITIALIZING [22s]m37D2B2A1m<0;1m-------------> 0% INITIALIZING [23s]m37D2B2A1m<0;1m-------------> 0% INITIALIZING [24s]m37D2B2A1m<0;1m-------------> 0% INITIALIZING [25s]m37D2B2ACannot use Kotlin build script compile avoidance with /root/.gradle/caches/7.4/generated-gradle-jars/gradle-api-7.4.jar: class org/gradle/configurationcache/extensions/AutoCloseableExtensionsKt: inline fun useToRun(): compile avoidance is not supported with public inline functions0K
1B0K
2A1m<0;1m-------------> 0% INITIALIZING [25s]m37D1B1m> Evaluating settingsm21D1B2ACannot use Kotlin build script compile avoidance with /root/.gradle/wrapper/dists/gradle-7.4-bin/c0gwcg53nkjbqw7r0h0umtfvt/gradle-7.4/lib/kotlin-stdlib-1.5.31.jar: class kotlin/ArrayIntrinsicsKt: inline fun emptyArray(): compile avoidance is not supported with public inline functions0K
Cannot use Kotlin build script compile avoidance with /root/.gradle/wrapper/dists/gradle-7.4-bin/c0gwcg53nkjbqw7r0h0umtfvt/gradle-7.4/lib/kotlin-reflect-1.5.31.jar: class kotlin/reflect/full/KAnnotatedElements: inline fun findAnnotation(): compile avoidance is not supported with public inline functions0K
Cannot use Kotlin build script compile avoidance with /root/.gradle/caches/7.4/generated-gradle-jars/gradle-kotlin-dsl-extensions-7.4.jar: class org/gradle/kotlin/dsl/GradleApiKotlinDslExtensions0Kt: inline fun environment(): compile avoidance is not supported with public inline functions
Cannot use Kotlin build script compile avoidance with /root/.gradle/wrapper/dists/gradle-7.4-bin/c0gwcg53nkjbqw7r0h0umtfvt/gradle-7.4/lib/gradle-kotlin-dsl-7.4.jar: class org/gradle/kotlin/dsl/ArtifactHandlerScope: inline fun invoke(): compile avoidance is not supported with public inline functions
0K
0K
2A1m<0;1m-------------> 0% INITIALIZING [25s]m37D1B1m> Evaluating settingsm21D1B2AKotlin DSL script compilation (Settings/TopLevel/stage1) is not up-to-date because:0K
No history is available.0K
0K
0K
2A1m<0;1m-------------> 0% INITIALIZING [25s]m37D1B1m> Evaluating settings > Compiling settings file 'settings.gradle.kts'm69D1B2A1m<0;1m-------------> 0% INITIALIZING [26s]m37D2B1A1m> Evaluating settingsm0K21D1B2ASettings evaluated using settings file '/home/r/repo/settings.gradle.kts'.0K
1B0K
2A1m<0;1m-------------> 0% CONFIGURING [26s]m36D1B1m> Loading projectsm18D1B2AProjects loaded. Root project using build file '/home/r/repo/build.gradle.kts'.0K
Included projects: [root project 'JavaParser']0K
0K
0K
2A1m<0;1m-------------> 0% CONFIGURING [26s]m36D1B1m> root projectm14D1B1A1m> root project > Compiling build file 'build.gradle.kts'm56D1B2A1m<0;1m-------------> 0% CONFIGURING [27s]m36D2B1A1m> root projectm0K14D1B2A1m<0;1m-------------> 0% CONFIGURING [28s]m36D2B2A0K
1m> Configure project :m0K
Evaluating root project 'JavaParser' using build file '/home/r/repo/build.gradle.kts'.
Caching disabled for Kotlin DSL plugin accessors for classpath 'e5c6096a41cb78f91b453d8031d0fb84' because:
Build cache is disabled
Kotlin DSL plugin accessors for classpath 'e5c6096a41cb78f91b453d8031d0fb84' is not up-to-date because:
No history is available.
Caching disabled for Kotlin DSL script compilation (Project/TopLevel/stage1) because:
Build cache is disabled
Kotlin DSL script compilation (Project/TopLevel/stage1) is not up-to-date because:
No history is available.
0K
0K
2A1m<0;1m-------------> 0% CONFIGURING [28s]m36D1B1m> root projectm14D1B2ACaching disabled for Kotlin DSL accessors for root project 'JavaParser' because:0K
Build cache is disabled0K
Kotlin DSL accessors for root project 'JavaParser' is not up-to-date because:
No history is available.
0K
0K
2A1m<0;1m-------------> 0% CONFIGURING [28s]m36D1B1m> root projectm14D1B2A1m<0;1m-------------> 0% CONFIGURING [29s]m36D2B2ACaching disabled for Kotlin DSL script compilation (Project/TopLevel/stage2) because:0K
Build cache is disabled0K
Kotlin DSL script compilation (Project/TopLevel/stage2) is not up-to-date because:
No history is available.
0K
0K
2A1m<0;1m-------------> 0% CONFIGURING [29s]m36D1B1m> root project > Compiling build file 'build.gradle.kts'm56D1B2A1m<0;1m-------------> 0% CONFIGURING [30s]m36D2B1A1m> root projectm0K14D1B2AWorking Directory = /home/r/repo0K
Grammar file changed since last build; Rebuilding parser with Bison...0K
Starting process 'command 'bison''. Working directory: /home/r/repo Command: bison --report=states,lookaheads --report-file=out/Java_16_Grammar.report --output=src/main/java/parser/JavaParser.java src/main/resources/Java_16_Grammar.y
Successfully started process 'command 'bison''
src/main/resources/Java_16_Grammar.y: warning: 3 nonterminals useless in grammar [-Wother]
src/main/resources/Java_16_Grammar.y: warning: 5 rules useless in grammar [-Wother]
src/main/resources/Java_16_Grammar.y:1468.1-14: warning: nonterminal useless in grammar: CastExpression [-Wother]
1468 | CastExpression
| ^~~~~~~~~~~~~~
src/main/resources/Java_16_Grammar.y:1473.1-10: warning: nonterminal useless in grammar: TargetType [-Wother]
1473 | TargetType
| ^~~~~~~~~~
src/main/resources/Java_16_Grammar.y:1477.1-8: warning: nonterminal useless in grammar: TypeList [-Wother]
1477 | TypeList
| ^~~~~~~~
src/main/resources/Java_16_Grammar.y: warning: 396 shift/reduce conflicts [-Wconflicts-sr]
src/main/resources/Java_16_Grammar.y: warning: 1 reduce/reduce conflict [-Wconflicts-rr]
src/main/resources/Java_16_Grammar.y: note: rerun with option '-Wcounterexamples' to generate conflict counterexamples
0K
0K
2A1m<0;1m-------------> 0% CONFIGURING [31s]m36D1B1m> root projectm14D1B2AWorking Directory = /home/r/repo0K
Applying Maven credentials0K
All projects evaluated.
0K
0K
2A1m<0;32;1m=============0;39;1m> 100% CONFIGURING [31s]m38D1B> IDLE6D1B2ASelected primary task 'build' from project :0K
1B0K
2A1m<0;32;1m=============0;39;1m> 100% CONFIGURING [31s]m38D1B> IDLE6D1B2ASelected primary task 'jar' from project :0K
Selected primary task 'publish' from project :0K
Tasks to be executed: [task ':compileJava', task ':processResources', task ':classes', task ':jar', task ':javadoc', task ':javadocJar', task ':sourcesJar', task ':assemble', task ':check', task ':build', task ':generateMetadataFileForMavenJavaPublication', task ':generatePomFileForMavenJavaPublication', task ':publishMavenJavaPublicationToMavenRepository', task ':publish']
Tasks that were excluded: [task ':test']
:compileJava (Thread[Execution worker for ':',5,main]) started.
0K
0K
2A1m<0;1m-------------> 0% EXECUTING [31s]m34D1B> IDLE6D1B1A1m> :compileJavam14D1B2A1m<0;1m-------------> 0% EXECUTING [32s]m34D1B1m> :compileJava > Resolve dependencies of :compileClasspathm58D1B1A1m> :compileJava > Resolve files of :compileClasspathm0K51D1B1A1m> :compileJavam0K14D1B2A1m<0;1m-------------> 0% EXECUTING [33s]m34D2B2A0K
1m> Task :compileJavam0K
Caching disabled for task ':compileJava' because:
Build cache is disabled
Task ':compileJava' is not up-to-date because:
No history is available.
The input changes require a full rebuild for incremental task ':compileJava'.
Full recompilation is required because no incremental change information is available. This is usually caused by clean builds or changing compiler arguments.
Compiling with toolchain '/usr/lib/jvm/java-17-openjdk'.
Compiling with JDK Java compiler API.
0K
0K
2A1m<0;1m-------------> 0% EXECUTING [33s]m34D1B1m> :compileJavam14D1B2A1m<0;1m-------------> 0% EXECUTING [34s]m34D2B2AClass dependency analysis for incremental compilation took 0.104 secs.0K
1B0K
2A1m<0;1m-------------> 0% EXECUTING [34s]m34D1B1m> :compileJavam14D1B2ACreated classpath snapshot for incremental compilation in 0.032 secs.0K
:compileJava (Thread[Execution worker for ':',5,main]) completed. Took 2.732 secs.0K
:processResources (Thread[included builds,5,main]) started.
1m> Task :processResourcesm
Caching disabled for task ':processResources' because:
Build cache is disabled
Task ':processResources' is not up-to-date because:
No history is available.
:processResources (Thread[included builds,5,main]) completed. Took 0.017 secs.
:classes (Thread[included builds,5,main]) started.
1m> Task :classesm
Skipping task ':classes' as it has no actions.
:classes (Thread[included builds,5,main]) completed. Took 0.0 secs.
:jar (Thread[included builds,5,main]) started.
0K
0K
2A1m<0;32;1m==0;39;1m-----------> 21% EXECUTING [34s]m35D1B1m> :jarm6D1B2A0K
1m> Task :jarm0K
Caching disabled for task ':jar' because:
Build cache is disabled
Task ':jar' is not up-to-date because:
No history is available.
:jar (Thread[included builds,5,main]) completed. Took 0.058 secs.
:javadoc (Thread[included builds,5,main]) started.
0K
0K
2A1m<0;32;1m===0;39;1m----------> 28% EXECUTING [34s]m35D1B1m> :javadocm10D1B2A1m<0;32;1m===0;39;1m----------> 28% EXECUTING [35s]m35D2B2A1m<0;32;1m===0;39;1m----------> 28% EXECUTING [36s]m35D2B2A0K
1m> Task :javadocm0K
Caching disabled for task ':javadoc' because:
Build cache is disabled
Task ':javadoc' is not up-to-date because:
No history is available.
Starting process 'command '/usr/lib/jvm/java-17-openjdk/bin/javadoc''. Working directory: /home/r/repo Command: /usr/lib/jvm/java-17-openjdk/bin/javadoc @/home/r/repo/build/tmp/javadoc/javadoc.options
Successfully started process 'command '/usr/lib/jvm/java-17-openjdk/bin/javadoc''
/home/r/repo/src/main/java/parser/JavaParser.java:811: error: tag not supported in HTML5: tt
* parser <tt>JavaParser</tt>.
^
/home/r/repo/src/main/java/tree/AnnoElementValue.java:3: warning: no comment
public class AnnoElementValue extends Entity {
^
/home/r/repo/src/main/java/tree/AnnoParameterList.java:20: warning: no comment
public class AnnoParameterList extends Entity {
^
/home/r/repo/src/main/java/tree/Annotation.java:9: warning: no comment
public class Annotation extends Entity {
^
/home/r/repo/src/main/java/tree/Annotation.java:12: warning: no comment
public AnnoParameterList annoParameterList;
^
/home/r/repo/src/main/java/tree/Annotation.java:11: warning: no comment
public CompoundName compoundName;
^
/home/r/repo/src/main/java/tree/Annotation.java:27: warning: no comment
public Annotation(CompoundName cn, AnnoElementValue aev) {
^
/home/r/repo/src/main/java/tree/Annotation.java:15: warning: no comment
public Annotation(CompoundName cn, AnnoParameterList apl) {
^
/home/r/repo/src/main/java/tree/Entity.java:62: warning: no comment
public void report(int sh) {
^
/home/r/repo/src/main/java/tree/Annotations.java:5: warning: no comment
public class Annotations extends Entity {
^
/home/r/repo/src/main/java/tree/Annotations.java:7: warning: no comment
public ArrayList<Annotation> annotations;
^
/home/r/repo/src/main/java/tree/Annotations.java:10: warning: no comment
public Annotations(Annotation ann) {
^
/home/r/repo/src/main/java/tree/Annotations.java:18: warning: no comment
public Annotations add(Annotation ann) {
^
/home/r/repo/src/main/java/tree/Expression/ArgumentList.java:15: warning: no comment
public class ArgumentList extends Entity {
^
/home/r/repo/src/main/java/tree/Expression/ArgumentList.java:17: warning: no comment
public ArrayList<Expression> arguments;
^
/home/r/repo/src/main/java/tree/Expression/ArgumentList.java:20: warning: no comment
public ArgumentList(Expression expr) {
^
/home/r/repo/src/main/java/tree/Expression/ArgumentList.java:28: warning: no comment
public ArgumentList add(Expression expr) {
^
/home/r/repo/src/main/java/tree/Expression/ArrayAccess.java:9: warning: no comment
public class ArrayAccess extends Expression {
^
/home/r/repo/src/main/java/tree/Expression/ArrayAccess.java:11: warning: no comment
public Expression expression;
^
/home/r/repo/src/main/java/tree/Expression/ArrayAccess.java:12: warning: no comment
public Expression size;
^
/home/r/repo/src/main/java/tree/Expression/ArrayAccess.java:15: warning: no comment
public ArrayAccess(Expression expr, Expression size) {
^
/home/r/repo/src/main/java/tree/Statement/Assert.java:13: warning: no comment
public class Assert extends Statement {
^
/home/r/repo/src/main/java/tree/Statement/Assert.java:16: warning: no comment
public Expression expression;
^
/home/r/repo/src/main/java/tree/Statement/Assert.java:17: warning: no comment
public Expression expression2;
^
/home/r/repo/src/main/java/tree/Statement/Assert.java:20: warning: no comment
public Assert(ArrayList<String> ls, Expression expr, Expression expr2) {
^
/home/r/repo/src/main/java/tree/Expression/Binary.java:7: warning: no comment
public class Binary extends Expression {
^
/home/r/repo/src/main/java/tree/Expression/Binary.java:9: warning: no comment
public Expression left;
^
/home/r/repo/src/main/java/tree/Expression/Binary.java:11: warning: no comment
public TokenCode operator;
^
/home/r/repo/src/main/java/tree/Expression/Binary.java:10: warning: no comment
public Expression right;
^
/home/r/repo/src/main/java/tree/Expression/Binary.java:14: warning: no comment
public Binary(Expression l, Expression r, Token token) {
^
/home/r/repo/src/main/java/tree/Statement/Block.java:19: warning: no comment
public class Block extends Statement {
^
/home/r/repo/src/main/java/tree/Statement/Block.java:22: warning: no comment
public BlockStatements block;
^
/home/r/repo/src/main/java/tree/Statement/Block.java:25: warning: no comment
public Block(ArrayList<String> ls, BlockStatements block) {
^
/home/r/repo/src/main/java/tree/Statement/BlockStatement.java:10: warning: no comment
public class BlockStatement extends Statement {
^
/home/r/repo/src/main/java/tree/Statement/BlockStatement.java:12: warning: no comment
public Declaration declaration;
^
/home/r/repo/src/main/java/tree/Statement/BlockStatement.java:14: warning: no comment
public Expression expression;
^
/home/r/repo/src/main/java/tree/Statement/BlockStatement.java:13: warning: no comment
public Statement statement;
^
/home/r/repo/src/main/java/tree/Statement/BlockStatement.java:17: warning: no comment
public BlockStatement(Declaration d) {
^
/home/r/repo/src/main/java/tree/Statement/BlockStatement.java:39: warning: no comment
public BlockStatement(Expression expr) {
^
/home/r/repo/src/main/java/tree/Statement/BlockStatement.java:28: warning: no comment
public BlockStatement(Statement stmt) {
^
/home/r/repo/src/main/java/tree/Statement/BlockStatements.java:9: warning: no comment
public class BlockStatements extends Entity {
^
/home/r/repo/src/main/java/tree/Statement/BlockStatements.java:11: warning: no comment
public ArrayList<BlockStatement> blockStatements;
^
/home/r/repo/src/main/java/tree/Statement/BlockStatements.java:14: warning: no comment
public BlockStatements(BlockStatement elem) {
^
/home/r/repo/src/main/java/tree/Statement/BlockStatements.java:19: warning: no comment
public BlockStatements add(BlockStatement elem) {
^
/home/r/repo/src/main/java/tree/Statement/Break.java:13: warning: no comment
public class Break extends Statement {
^
/home/r/repo/src/main/java/tree/Statement/Break.java:16: warning: no comment
public String label;
^
/home/r/repo/src/main/java/tree/Statement/Break.java:19: warning: no comment
public Break(ArrayList<String> ls, Token label) {
^
/home/r/repo/src/main/java/tree/Expression/Cast.java:10: warning: no comment
public class Cast extends Expression {
^
/home/r/repo/src/main/java/tree/Expression/Cast.java:13: warning: no comment
public Expression expression;
^
/home/r/repo/src/main/java/tree/Expression/Cast.java:12: warning: no comment
public TypeList types;
^
/home/r/repo/src/main/java/tree/Expression/Cast.java:16: warning: no comment
public Cast(TypeList types, Expression expr) {
^
/home/r/repo/src/main/java/tree/Statement/CatchClause.java:9: warning: no comment
public class CatchClause extends Entity {
^
/home/r/repo/src/main/java/tree/Statement/CatchClause.java:12: warning: no comment
public Block block;
^
/home/r/repo/src/main/java/tree/Statement/CatchClause.java:11: warning: no comment
public CatchParameter catchParameter;
^
/home/r/repo/src/main/java/tree/Statement/CatchClause.java:15: warning: no comment
public CatchClause(CatchParameter catchPar, Block b) {
^
/home/r/repo/src/main/java/tree/Statement/CatchClauses.java:15: warning: no comment
public class CatchClauses extends Entity {
^
/home/r/repo/src/main/java/tree/Statement/CatchClauses.java:17: warning: no comment
public ArrayList<CatchClause> catchClauses;
^
/home/r/repo/src/main/java/tree/Statement/CatchClauses.java:20: warning: no comment
public CatchClauses(CatchClause clause) {
^
/home/r/repo/src/main/java/tree/Statement/CatchClauses.java:28: warning: no comment
public CatchClauses add(CatchClause clause) {
^
/home/r/repo/src/main/java/tree/Declaration/CatchParameter.java:16: warning: no comment
public class CatchParameter extends ParameterDeclaration {
^
/home/r/repo/src/main/java/tree/Declaration/CatchParameter.java:27: warning: no comment
public TypeList catchTypes;
^
/home/r/repo/src/main/java/tree/Declaration/CatchParameter.java:30: warning: no comment
public CatchParameter(Modifiers mods, TypeList types, Token id, Dims dims) {
^
/home/r/repo/src/main/java/tree/Declaration/ClassDeclaration.java:10: warning: no comment
public class ClassDeclaration extends Declaration {
^
/home/r/repo/src/main/java/tree/Declaration/ClassDeclaration.java:14: warning: no comment
public ClassDeclaration(Modifiers mods, String n) {
^
/home/r/repo/src/main/java/tree/Declaration/ClassInitializer.java:11: warning: no comment
public class ClassInitializer extends Declaration {
^
/home/r/repo/src/main/java/tree/Declaration/ClassInitializer.java:13: warning: no comment
public Block block;
^
/home/r/repo/src/main/java/tree/Declaration/ClassInitializer.java:14: warning: no comment
public boolean signStatic;
^
/home/r/repo/src/main/java/tree/Declaration/ClassInitializer.java:17: warning: no comment
public ClassInitializer(Block b, boolean ss) {
^
/home/r/repo/src/main/java/tree/Expression/Primary/ClassLiteral.java:12: warning: no comment
public class ClassLiteral extends Literal {
^
/home/r/repo/src/main/java/tree/Expression/Primary/ClassLiteral.java:15: warning: no comment
public Dims dims;
^
/home/r/repo/src/main/java/tree/Expression/Primary/ClassLiteral.java:14: warning: no comment
public Type type; // VOID, if type==null
^
/home/r/repo/src/main/java/tree/Expression/Primary/ClassLiteral.java:18: warning: no comment
public ClassLiteral(Type t, Dims d) {
^
/home/r/repo/src/main/java/tree/Compilation/CompilationUnit.java:11: warning: no comment
public class CompilationUnit extends Entity {
^
/home/r/repo/src/main/java/tree/CompoundName.java:12: warning: no comment
public class CompoundName extends Entity {
^
/home/r/repo/src/main/java/tree/CompoundName.java:14: warning: no comment
public ArrayList<String> names;
^
/home/r/repo/src/main/java/tree/CompoundName.java:17: warning: no comment
public CompoundName(String first) {
^
/home/r/repo/src/main/java/tree/CompoundName.java:22: warning: no comment
public CompoundName(List<String> name) {
^
/home/r/repo/src/main/java/tree/CompoundName.java:27: warning: no comment
public CompoundName add(String next) {
^
/home/r/repo/src/main/java/tree/CompoundName.java:36: warning: no comment
public String concatenatedEO() {
^
/home/r/repo/src/main/java/tree/CompoundName.java:32: warning: no comment
public String concatenatedJava() {
^
/home/r/repo/src/main/java/tree/Expression/Conditional.java:14: warning: no comment
public class Conditional extends Expression {
^
/home/r/repo/src/main/java/tree/Expression/Conditional.java:16: warning: no comment
public Expression condition;
^
/home/r/repo/src/main/java/tree/Expression/Conditional.java:18: warning: no comment
public Expression elsePart;
^
/home/r/repo/src/main/java/tree/Expression/Conditional.java:17: warning: no comment
public Expression thenPart;
^
/home/r/repo/src/main/java/tree/Expression/Conditional.java:21: warning: no comment
public Conditional(Expression c, Expression t, Expression e) {
^
/home/r/repo/src/main/java/tree/Declaration/ConstructorBody.java:12: warning: no comment
public class ConstructorBody extends Entity {
^
/home/r/repo/src/main/java/tree/Declaration/ConstructorBody.java:15: warning: no comment
public Block block;
^
/home/r/repo/src/main/java/tree/Declaration/ConstructorBody.java:14: warning: no comment
public ExplicitConstructorInvocation invocation;
^
/home/r/repo/src/main/java/tree/Declaration/ConstructorBody.java:18: warning: no comment
public ConstructorBody(ExplicitConstructorInvocation inv, Block block) {
^
/home/r/repo/src/main/java/tree/Declaration/ConstructorDeclaration.java:22: warning: no comment
public class ConstructorDeclaration extends MethodDeclaration {
^
/home/r/repo/src/main/java/tree/Declaration/ConstructorDeclaration.java:32: warning: no comment
public ExplicitConstructorInvocation invocation;
^
/home/r/repo/src/main/java/tree/Declaration/ConstructorDeclaration.java:36: warning: no comment
public ConstructorDeclaration(Modifiers mods,
^
/home/r/repo/src/main/java/tree/Declaration/ConstructorDeclarator.java:11: warning: no comment
public class ConstructorDeclarator extends Entity {
^
/home/r/repo/src/main/java/tree/Declaration/ConstructorDeclarator.java:14: warning: no comment
public ParameterDeclarations formalParameters;
^
/home/r/repo/src/main/java/tree/Declaration/ConstructorDeclarator.java:13: warning: no comment
public TypeParameters typeParameters;
^
/home/r/repo/src/main/java/tree/Declaration/ConstructorDeclarator.java:17: warning: no comment
public ConstructorDeclarator(TypeParameters tpars, ParameterDeclarations pars) {
^
/home/r/repo/src/main/java/tree/Statement/Continue.java:13: warning: no comment
public class Continue extends Statement {
^
/home/r/repo/src/main/java/tree/Statement/Continue.java:16: warning: no comment
public String label;
^
/home/r/repo/src/main/java/tree/Statement/Continue.java:19: warning: no comment
public Continue(ArrayList<String> ls, Token label) {
^
/home/r/repo/src/main/java/tree/Declaration/Declaration.java:38: warning: no comment
public class Declaration extends Entity {
^
/home/r/repo/src/main/java/tree/Declaration/Declaration.java:41: warning: no comment
public Modifiers modifiers;
^
0K
0K
2A1m<0;32;1m===0;39;1m----------> 28% EXECUTING [36s]m35D1B1m> :javadocm10D1B2A/home/r/repo/src/main/java/parser/JavaParser.java:1185: error: tag not supported in HTML5: tt0K
* return success (<tt>true</tt>).0K
^
/home/r/repo/src/main/java/parser/JavaParser.java:1191: error: tag not supported in HTML5: tt
* return failure (<tt>false</tt>).
^
/home/r/repo/src/main/java/parser/JavaParser.java:4128: error: tag not supported in HTML5: tt
* @return <tt>true</tt> if the parsing succeeds. Note that this does not
^
0K
0K
2A1m<0;32;1m===0;39;1m----------> 28% EXECUTING [36s]m35D1B1m> :javadocm10D1B2A1m<0;32;1m===0;39;1m----------> 28% EXECUTING [37s]m35D2B2A4 errors0K
100 warnings0K
0K
0K
2A1m<0;32;1m===0;39;1m----------> 28% EXECUTING [37s]m35D1B1m> :javadocm10D1B2AProblems generating Javadoc.0K
Command line issued: [/usr/lib/jvm/java-17-openjdk/bin/javadoc, @/home/r/repo/build/tmp/javadoc/javadoc.options]0K
Generated Javadoc options file has following contents:
------
-classpath '/home/r/repo/build/classes/java/main:/home/r/repo/build/resources/main:/root/.gradle/caches/modules-2/files-2.1/commons-cli/commons-cli/1.5.0/dc98be5d5390230684a092589d70ea76a147925c/commons-cli-1.5.0.jar'
-d '/home/r/repo/build/docs/javadoc'
-doctitle 'JavaParser 0.0.2 API'
-notimestamp
-quiet
-windowtitle 'JavaParser 0.0.2 API'
'/home/r/repo/src/main/java/parser/JavaParser.java'
'/home/r/repo/src/main/java/lexer/Span.java'
'/home/r/repo/src/main/java/lexer/Scanner.java'
'/home/r/repo/src/main/java/lexer/Pos.java'
'/home/r/repo/src/main/java/lexer/TokenCode.java'
'/home/r/repo/src/main/java/lexer/Token.java'
'/home/r/repo/src/main/java/main/Main.java'
'/home/r/repo/src/main/java/tree/Compilation/SimpleCompilationUnit.java'
'/home/r/repo/src/main/java/tree/Compilation/Module.java'
'/home/r/repo/src/main/java/tree/Compilation/TopLevelComponents.java'
'/home/r/repo/src/main/java/tree/Compilation/CompilationUnit.java'
'/home/r/repo/src/main/java/tree/Compilation/TopLevelComponent.java'
'/home/r/repo/src/main/java/tree/Compilation/Package.java'
'/home/r/repo/src/main/java/tree/AnnoParameterList.java'
'/home/r/repo/src/main/java/tree/Expression/Lambda.java'
'/home/r/repo/src/main/java/tree/Expression/Primary/ClassLiteral.java'
'/home/r/repo/src/main/java/tree/Expression/Primary/Parenthesized.java'
'/home/r/repo/src/main/java/tree/Expression/Primary/InstanceCreation.java'
'/home/r/repo/src/main/java/tree/Expression/Primary/This.java'
'/home/r/repo/src/main/java/tree/Expression/Primary/Primary.java'
'/home/r/repo/src/main/java/tree/Expression/Primary/MethodInvocation.java'
'/home/r/repo/src/main/java/tree/Expression/Primary/Literal.java'
'/home/r/repo/src/main/java/tree/Expression/SimpleReference.java'
'/home/r/repo/src/main/java/tree/Expression/FieldAccess.java'
'/home/r/repo/src/main/java/tree/Expression/Binary.java'
'/home/r/repo/src/main/java/tree/Expression/UnaryPrefix.java'
'/home/r/repo/src/main/java/tree/Expression/ArrayAccess.java'
'/home/r/repo/src/main/java/tree/Expression/ArgumentList.java'
'/home/r/repo/src/main/java/tree/Expression/InstanceOf.java'
'/home/r/repo/src/main/java/tree/Expression/Conditional.java'
'/home/r/repo/src/main/java/tree/Expression/Expressions.java'
'/home/r/repo/src/main/java/tree/Expression/SwitchExpression.java'
'/home/r/repo/src/main/java/tree/Expression/UnaryPostfix.java'
'/home/r/repo/src/main/java/tree/Expression/Cast.java'
'/home/r/repo/src/main/java/tree/Expression/Expression.java'
'/home/r/repo/src/main/java/tree/Type/Type.java'
'/home/r/repo/src/main/java/tree/Type/TypeName.java'
'/home/r/repo/src/main/java/tree/Type/TypeParameters.java'
'/home/r/repo/src/main/java/tree/Type/UnannotatedType.java'
'/home/r/repo/src/main/java/tree/Type/TypeParameter.java'
'/home/r/repo/src/main/java/tree/Type/TypeArguments.java'
'/home/r/repo/src/main/java/tree/Type/PrimitiveType.java'
'/home/r/repo/src/main/java/tree/Type/TypeArgument.java'
'/home/r/repo/src/main/java/tree/Type/TypeParameterTail.java'
'/home/r/repo/src/main/java/tree/Type/TypeList.java'
'/home/r/repo/src/main/java/tree/StandardModifiers.java'
'/home/r/repo/src/main/java/tree/AnnoElementValue.java'
'/home/r/repo/src/main/java/tree/Declaration/ClassDeclaration.java'
'/home/r/repo/src/main/java/tree/Declaration/VariableDeclaration.java'
'/home/r/repo/src/main/java/tree/Declaration/RecordDeclaration.java'
'/home/r/repo/src/main/java/tree/Declaration/ImportDeclarations.java'
'/home/r/repo/src/main/java/tree/Declaration/ParameterDeclarations.java'
'/home/r/repo/src/main/java/tree/Declaration/CatchParameter.java'
'/home/r/repo/src/main/java/tree/Declaration/Enumerator.java'
'/home/r/repo/src/main/java/tree/Declaration/ParameterTail.java'
'/home/r/repo/src/main/java/tree/Declaration/MethodDeclarator.java'
'/home/r/repo/src/main/java/tree/Declaration/ClassInitializer.java'
'/home/r/repo/src/main/java/tree/Declaration/EnumDeclaration.java'
'/home/r/repo/src/main/java/tree/Declaration/MethodHeader.java'
'/home/r/repo/src/main/java/tree/Declaration/RecordComponents.java'
'/home/r/repo/src/main/java/tree/Declaration/ConstructorDeclaration.java'
'/home/r/repo/src/main/java/tree/Declaration/RecordComponent.java'
'/home/r/repo/src/main/java/tree/Declaration/VariableDeclarators.java'
'/home/r/repo/src/main/java/tree/Declaration/Declaration.java'
'/home/r/repo/src/main/java/tree/Declaration/TypeAndDeclarators.java'
'/home/r/repo/src/main/java/tree/Declaration/MethodDeclaration.java'
'/home/r/repo/src/main/java/tree/Declaration/ImportDeclaration.java'
'/home/r/repo/src/main/java/tree/Declaration/Declarations.java'
'/home/r/repo/src/main/java/tree/Declaration/ConstructorDeclarator.java'
'/home/r/repo/src/main/java/tree/Declaration/NormalClassDeclaration.java'
'/home/r/repo/src/main/java/tree/Declaration/ConstructorBody.java'
'/home/r/repo/src/main/java/tree/Declaration/InterfaceDeclaration.java'
'/home/r/repo/src/main/java/tree/Declaration/Enumerators.java'
'/home/r/repo/src/main/java/tree/Declaration/ExplicitConstructorInvocation.java'
'/home/r/repo/src/main/java/tree/Declaration/ParameterDeclaration.java'
'/home/r/repo/src/main/java/tree/Declaration/ReceiverDeclaration.java'
'/home/r/repo/src/main/java/tree/Declaration/EnumBody.java'
'/home/r/repo/src/main/java/tree/Declaration/NormalInterfaceDeclaration.java'
'/home/r/repo/src/main/java/tree/Declaration/VariableDeclarator.java'
'/home/r/repo/src/main/java/tree/Dim.java'
'/home/r/repo/src/main/java/tree/InitializerSimple.java'
'/home/r/repo/src/main/java/tree/Statement/Statement.java'
'/home/r/repo/src/main/java/tree/Statement/IfThenElse.java'
'/home/r/repo/src/main/java/tree/Statement/SwitchLabels.java'
'/home/r/repo/src/main/java/tree/Statement/Yield.java'
'/home/r/repo/src/main/java/tree/Statement/BlockStatement.java'
'/home/r/repo/src/main/java/tree/Statement/Break.java'
'/home/r/repo/src/main/java/tree/Statement/Assert.java'
'/home/r/repo/src/main/java/tree/Statement/Block.java'
'/home/r/repo/src/main/java/tree/Statement/SwitchBlocks.java'
'/home/r/repo/src/main/java/tree/Statement/Throw.java'
'/home/r/repo/src/main/java/tree/Statement/SwitchRule.java'
'/home/r/repo/src/main/java/tree/Statement/Continue.java'
'/home/r/repo/src/main/java/tree/Statement/StatementExpressions.java'
'/home/r/repo/src/main/java/tree/Statement/StatementExpression.java'
'/home/r/repo/src/main/java/tree/Statement/SwitchRules.java'
'/home/r/repo/src/main/java/tree/Statement/Synchronized.java'
'/home/r/repo/src/main/java/tree/Statement/Return.java'
'/home/r/repo/src/main/java/tree/Statement/CatchClause.java'
'/home/r/repo/src/main/java/tree/Statement/Try.java'
'/home/r/repo/src/main/java/tree/Statement/While.java'
'/home/r/repo/src/main/java/tree/Statement/SwitchBlock.java'
'/home/r/repo/src/main/java/tree/Statement/Switch.java'
'/home/r/repo/src/main/java/tree/Statement/CatchClauses.java'
'/home/r/repo/src/main/java/tree/Statement/Do.java'
'/home/r/repo/src/main/java/tree/Statement/BlockStatements.java'
'/home/r/repo/src/main/java/tree/Statement/SwitchLabel.java'
'/home/r/repo/src/main/java/tree/ResourceSpecification.java'
'/home/r/repo/src/main/java/tree/Modifiers.java'
'/home/r/repo/src/main/java/tree/Dims.java'
'/home/r/repo/src/main/java/tree/Annotations.java'
'/home/r/repo/src/main/java/tree/InitializerArray.java'
'/home/r/repo/src/main/java/tree/Annotation.java'
'/home/r/repo/src/main/java/tree/Entity.java'
'/home/r/repo/src/main/java/tree/CompoundName.java'
'/home/r/repo/src/main/java/tree/Initializer.java'
------
31;1m> Task :javadoc0;39m31m FAILED39m
:javadoc (Thread[included builds,5,main]) completed. Took 3.354 secs.
31mFAILURE: 39m31mBuild failed with an exception.39m
* What went wrong:
Execution failed for task ':javadoc'.
33m> 39mJavadoc generation failed. Generated Javadoc options file (useful for troubleshooting): '/home/r/repo/build/tmp/javadoc/javadoc.options'
* Try:
33m> 39mRun with 1m--stacktracem option to get the stack trace.
33m> 39mRun with 1m--debugm option to get more log output.
33m> 39mRun with 1m--scanm to get full insights.
* Get more help at 1mhttps://help.gradle.orgm
31;1mBUILD FAILED0;39m in 50s
4 actionable tasks: 4 executed
Some of the file system contents retained in the virtual file system are on file systems that Gradle doesn't support watching. The relevant state was discarded to ensure changes to these locations are properly detected. You can override this by explicitly enabling file system watching.
0K
0K
2A1m<0;1m-------------> 0% WAITINGm26D1B> IDLE6D1B2A2K1B2K1A0m?12l?25hcontainer 4a8ef1ffe6ce653fbbeaa64b486c777eb546627001e0bc3c69af92b5f0b8c6e9 is dead
Sun Feb 27 10:00:09 CET 2022