rultor.com logo This build log was produced by rultor.com for jcabi/jcabi-aspects#456
++ dirname ./run.sh
+ cd .
+ echo 1384
+ echo '2.0-SNAPSHOT BUILD'
2.0-SNAPSHOT BUILD
+ date
Tue Sep 15 03:01:43 UTC 2026
+ uptime
 03:01:43 up 4 min,  0 users,  load average: 0.18, 0.23, 0.11
+ ff=default
+ image=yegor256/java
+ rebase=false
+ head_branch=master
+ pull_title='Update dependency com.qulice:qulice-maven-plugin to v0.36.0'
+ author=yegor256
+ directory=
+ head=git@github.com:jcabi/jcabi-aspects.git
+ pull_id=456
+ fork=git@github.com:jcabi/jcabi-aspects.git
+ fork_branch=renovate/com.qulice-qulice-maven-plugin-0.x
+ squash=false
+ vars=('--env=head=git@github.com:jcabi/jcabi-aspects.git' '--env=pull_id=456' '--env=fork=git@github.com:jcabi/jcabi-aspects.git' '--env=fork_branch=renovate/com.qulice-qulice-maven-plugin-0.x' '--env=head_branch=master' '--env=pull_title=Update dependency com.qulice:qulice-maven-plugin to v0.36.0' '--env=author=yegor256' '--env=scripts=( '\''export '\''\'\'''\''head=git@github.com:jcabi/jcabi-aspects.git'\''\'\'''\'''\'' '\'';'\'' '\''export '\''\'\'''\''pull_id=456'\''\'\'''\'''\'' '\'';'\'' '\''export '\''\'\'''\''fork=git@github.com:jcabi/jcabi-aspects.git'\''\'\'''\'''\'' '\'';'\'' '\''export '\''\'\'''\''fork_branch=renovate/com.qulice-qulice-maven-plugin-0.x'\''\'\'''\'''\'' '\'';'\'' '\''export '\''\'\'''\''head_branch=master'\''\'\'''\'''\'' '\'';'\'' '\''export '\''\'\'''\''pull_title=Update dependency com.qulice:qulice-maven-plugin to v0.36.0'\''\'\'''\'''\'' '\'';'\'' '\''export '\''\'\'''\''author=yegor256'\''\'\'''\'''\'' '\'';'\'' '\''pdd --file=/dev/null'\'' '\'';'\'' '\''mvn clean install -ntp -Pqulice --errors --batch-mode'\'' '\'';'\'' )')
+ scripts=('export '\''head=git@github.com:jcabi/jcabi-aspects.git'\''' ';' 'export '\''pull_id=456'\''' ';' 'export '\''fork=git@github.com:jcabi/jcabi-aspects.git'\''' ';' 'export '\''fork_branch=renovate/com.qulice-qulice-maven-plugin-0.x'\''' ';' 'export '\''head_branch=master'\''' ';' 'export '\''pull_title=Update dependency com.qulice:qulice-maven-plugin to v0.36.0'\''' ';' 'export '\''author=yegor256'\''' ';' 'pdd --file=/dev/null' ';' 'mvn clean install -ntp -Pqulice --errors --batch-mode' ';')
+ container=jcabi_jcabi-aspects_456
+ as_root=false
+ set -e -o pipefail
+ hostname
ip-172-31-19-21
+ pwd
/tmp/rultor-UkH3
+ git --version
git version 2.34.1
+ docker --version
Docker version 25.0.3, build 4debf41
+ mkdir -p /home/ubuntu/.ssh
+ echo -e 'Host github.com\n\tStrictHostKeyChecking no\n'
+ chmod 600 /home/ubuntu/.ssh/config
+ git clone --recurse-submodules git@github.com:jcabi/jcabi-aspects.git repo
Cloning into 'repo'...
Warning: Permanently added 'github.com' (ED25519) to the list of known hosts.
+ cd repo
+ git config user.email gpg@rultor.com
+ git config user.name Rultor.com
+ '[' -z 'export '\''head=git@github.com:jcabi/jcabi-aspects.git'\''' ']'
+ cd ..
+ cat
+ '[' false = true ']'
+ cat
+ chmod a+x entry.sh
+ cat
+ echo 'export '\''head=git@github.com:jcabi/jcabi-aspects.git'\''' ';' 'export '\''pull_id=456'\''' ';' 'export '\''fork=git@github.com:jcabi/jcabi-aspects.git'\''' ';' 'export '\''fork_branch=renovate/com.qulice-qulice-maven-plugin-0.x'\''' ';' 'export '\''head_branch=master'\''' ';' 'export '\''pull_title=Update dependency com.qulice:qulice-maven-plugin to v0.36.0'\''' ';' 'export '\''author=yegor256'\''' ';' 'pdd --file=/dev/null' ';' 'mvn clean install -ntp -Pqulice --errors --batch-mode' ';'
+ sensitive=()
+ set -ex -o pipefail
+ cd repo
+ git remote add fork git@github.com:jcabi/jcabi-aspects.git
+ git remote update
Fetching origin
Fetching fork
From github.com:jcabi/jcabi-aspects
 * [new branch]        andreoss-patch-1 -> fork/andreoss-patch-1
 * [new branch]        arc              -> fork/arc
 * [new branch]        ci               -> fork/ci
 * [new branch]        dependabot/maven/com.jcabi-jcabi-1.27.0 -> fork/dependabot/maven/com.jcabi-jcabi-1.27.0
 * [new branch]        dependabot/maven/com.jcabi-jcabi-log-0.19.0 -> fork/dependabot/maven/com.jcabi-jcabi-log-0.19.0
 * [new branch]        dependabot/maven/javax.el-javax.el-api-3.0.1-b06 -> fork/dependabot/maven/javax.el-javax.el-api-3.0.1-b06
 * [new branch]        dependabot/maven/org.aspectj-aspectjrt-1.9.6 -> fork/dependabot/maven/org.aspectj-aspectjrt-1.9.6
 * [new branch]        dependabot/maven/org.eluder.coveralls-coveralls-maven-plugin-4.3.0 -> fork/dependabot/maven/org.eluder.coveralls-coveralls-maven-plugin-4.3.0
 * [new branch]        gh-pages         -> fork/gh-pages
 * [new branch]        issue-289        -> fork/issue-289
 * [new branch]        master           -> fork/master
 * [new branch]        remove-logs      -> fork/remove-logs
 * [new branch]        renovate/com.jcabi-parent-0.x -> fork/renovate/com.jcabi-parent-0.x
 * [new branch]        renovate/com.qulice-qulice-maven-plugin-0.x -> fork/renovate/com.qulice-qulice-maven-plugin-0.x
 * [new branch]        renovate/crate-ci-typos-1.x -> fork/renovate/crate-ci-typos-1.x
 * [new branch]        renovate/major-hibernate-validator -> fork/renovate/major-hibernate-validator
 * [new branch]        renovate/org.codehaus.mojo-aspectj-maven-plugin-1.x -> fork/renovate/org.codehaus.mojo-aspectj-maven-plugin-1.x
 * [new branch]        renovate/org.codehaus.mojo-templating-maven-plugin-3.x -> fork/renovate/org.codehaus.mojo-templating-maven-plugin-3.x
 * [new branch]        renovate/reviewdog-action-actionlint-1.x -> fork/renovate/reviewdog-action-actionlint-1.x
 * [new branch]        skip-site-deploy -> fork/skip-site-deploy
 * [new branch]        use-jdk-8        -> fork/use-jdk-8
+ args=()
+ '[' default == default ']'
+ args+=(--ff)
+ '[' default == no ']'
+ '[' default == only ']'
+ '[' false == true ']'
+ BRANCH=__rultor
++ wc -l
++ git show-branch __rultor
+ '[' 0 -gt 0 ']'
+ export BRANCH
+ git status
On branch master
Your branch is up to date with 'origin/master'.

nothing to commit, working tree clean
+ git checkout -B __rultor fork/renovate/com.qulice-qulice-maven-plugin-0.x
Switched to a new branch '__rultor'
Branch '__rultor' set up to track remote branch 'renovate/com.qulice-qulice-maven-plugin-0.x' from 'fork'.
+ git checkout -B master origin/master
Switched to and reset branch 'master'
Branch 'master' set up to track remote branch 'master' from 'origin'.
Your branch is up to date with 'origin/master'.
+ '[' false == true ']'
+ KEY=3FD3FA7E9AF0FA4C
+ git merge --gpg-sign=3FD3FA7E9AF0FA4C --no-edit -m 'Update dependency com.qulice:qulice-maven-plugin to v0.36.0' --ff __rultor
Updating 882b04c2..40a237fd
Fast-forward (no commit created; -m option ignored)
 pom.xml | 2 +-
 1 file changed, 1 insertion(+), 1 deletion(-)
+ git log -1 --show-signature
commit 40a237fdf60d4772a6cf66e8bffc7be3add7d29b
gpg: Signature made Mon Sep 14 16:38:57 2026 UTC
gpg:                using RSA key B5690EEEBB952194
gpg: Can't check signature: No public key
Author: renovate[bot] <29139614+renovate[bot]@users.noreply.github.com>
Date:   Mon Sep 14 16:38:57 2026 +0000

    Update dependency com.qulice:qulice-maven-plugin to v0.36.0
+ docker_when_possible
+ true
++ tail -n 1
++ sed 's/ /\n/g'
++ uptime
+ load=0.11
++ bc
++ echo 0.11 '>' 30
+ '[' 0 -eq 1 ']'
+ echo 'load average is 0.11, low enough to run a new Docker container'
load average is 0.11, low enough to run a new Docker container
+ break
+ cd ..
+ '[' -n '' ']'
+ use_image=yegor256/java
+ docker pull yegor256/java
Using default tag: latest
latest: Pulling from yegor256/java
cb259a83ac3d: Pulling fs layer
4f4fb700ef54: Pulling fs layer
50778be6ae7c: Pulling fs layer
de39015cb2a0: Pulling fs layer
c5d1f12c356a: Pulling fs layer
e9b75b04736a: Pulling fs layer
74aacb7acb4e: Pulling fs layer
b343964c14ed: Pulling fs layer
2da5d65999c3: Pulling fs layer
f8ae7b3bd9d2: Pulling fs layer
62bf76adc5c1: Pulling fs layer
6f3edb78ee5d: Pulling fs layer
de39015cb2a0: Waiting
c5d1f12c356a: Waiting
e9b75b04736a: Waiting
74aacb7acb4e: Waiting
b343964c14ed: Waiting
2da5d65999c3: Waiting
f8ae7b3bd9d2: Waiting
62bf76adc5c1: Waiting
6f3edb78ee5d: Waiting
4f4fb700ef54: Verifying Checksum
4f4fb700ef54: Download complete
50778be6ae7c: Verifying Checksum
50778be6ae7c: Download complete
cb259a83ac3d: Verifying Checksum
cb259a83ac3d: Download complete
e9b75b04736a: Verifying Checksum
e9b75b04736a: Download complete
74aacb7acb4e: Verifying Checksum
74aacb7acb4e: Download complete
b343964c14ed: Verifying Checksum
b343964c14ed: Download complete
2da5d65999c3: Verifying Checksum
2da5d65999c3: Download complete
c5d1f12c356a: Verifying Checksum
c5d1f12c356a: Download complete
62bf76adc5c1: Verifying Checksum
62bf76adc5c1: Download complete
cb259a83ac3d: Pull complete
4f4fb700ef54: Pull complete
de39015cb2a0: Verifying Checksum
de39015cb2a0: Download complete
50778be6ae7c: Pull complete
f8ae7b3bd9d2: Verifying Checksum
f8ae7b3bd9d2: Download complete
6f3edb78ee5d: Verifying Checksum
6f3edb78ee5d: Download complete
de39015cb2a0: Pull complete
c5d1f12c356a: Pull complete
e9b75b04736a: Pull complete
74aacb7acb4e: Pull complete
b343964c14ed: Pull complete
2da5d65999c3: Pull complete
f8ae7b3bd9d2: Pull complete
62bf76adc5c1: Pull complete
6f3edb78ee5d: Pull complete
Digest: sha256:321ee930e2e2723cfabc943101c63a26019e88bb50a6a98690958ec3649391bc
Status: Downloaded newer image for yegor256/java:latest
docker.io/yegor256/java:latest
+ grep --quiet '\sjcabi_jcabi-aspects_456\s*$'
+ docker ps --filter=status=exited
+ ls -al .
total 64
drwx------  3 ubuntu ubuntu 4096 Sep 15 03:01 .
drwxrwxrwt 12 root   root   4096 Sep 15 03:01 ..
-rwxrwxr-x  1 ubuntu ubuntu  666 Sep 15 03:01 end.sh
-rwxrwxr-x  1 ubuntu ubuntu  498 Sep 15 03:01 entry.sh
-rw-rw-r--  1 ubuntu ubuntu    5 Sep 15 03:01 pid
-rw-rw-r--  1 ubuntu ubuntu 1192 Sep 15 03:01 pubring.gpg
drwxrwxr-x  6 ubuntu ubuntu 4096 Sep 15 03:01 repo
-rwxrwxr-x  1 ubuntu ubuntu 6679 Sep 15 03:01 run.sh
-rw-rw-r--  1 ubuntu ubuntu  605 Sep 15 03:01 script.sh
-rw-rw-r--  1 ubuntu ubuntu 2570 Sep 15 03:01 secring.gpg
-rw-rw-r--  1 ubuntu ubuntu 4430 Sep 15 03:01 settings.xml
-rw-rw-r--  1 ubuntu ubuntu 9346 Sep 15 03:02 stdout
++ pwd
++ pwd
+ docker run -t --rm -v /tmp/rultor-UkH3:/main --env=head=git@github.com:jcabi/jcabi-aspects.git --env=pull_id=456 --env=fork=git@github.com:jcabi/jcabi-aspects.git --env=fork_branch=renovate/com.qulice-qulice-maven-plugin-0.x --env=head_branch=master '--env=pull_title=Update dependency com.qulice:qulice-maven-plugin to v0.36.0' --env=author=yegor256 '--env=scripts=( '\''export '\''\'\'''\''head=git@github.com:jcabi/jcabi-aspects.git'\''\'\'''\'''\'' '\'';'\'' '\''export '\''\'\'''\''pull_id=456'\''\'\'''\'''\'' '\'';'\'' '\''export '\''\'\'''\''fork=git@github.com:jcabi/jcabi-aspects.git'\''\'\'''\'''\'' '\'';'\'' '\''export '\''\'\'''\''fork_branch=renovate/com.qulice-qulice-maven-plugin-0.x'\''\'\'''\'''\'' '\'';'\'' '\''export '\''\'\'''\''head_branch=master'\''\'\'''\'''\'' '\'';'\'' '\''export '\''\'\'''\''pull_title=Update dependency com.qulice:qulice-maven-plugin to v0.36.0'\''\'\'''\'''\'' '\'';'\'' '\''export '\''\'\'''\''author=yegor256'\''\'\'''\'''\'' '\'';'\'' '\''pdd --file=/dev/null'\'' '\'';'\'' '\''mvn clean install -ntp -Pqulice --errors --batch-mode'\'' '\'';'\'' )' --hostname=docker --privileged --net=host --dns 8.8.8.8 --add-host docker:127.0.0.1 --memory=8g --memory-swap=16g --oom-kill-disable --cidfile=/tmp/rultor-UkH3/cid -w=/main -v /var/run/docker.sock:/var/run/docker.sock --name=jcabi_jcabi-aspects_456 yegor256/java /main/entry.sh
WARNING: Your kernel does not support OomKillDisable. OomKillDisable discarded.
+ set -e
+ set -o pipefail
+ shopt -s dotglob
+ useradd -m -G sudo r
++ awk -F : '$3 > 100 { print $1 }'
++ cat /etc/group
+ for g in $(cat /etc/group | awk -F ':' '$3 > 100 { print $1 }')
+ usermod -a -G nogroup r
+ for g in $(cat /etc/group | awk -F ':' '$3 > 100 { print $1 }')
+ usermod -a -G ubuntu r
+ for g in $(cat /etc/group | awk -F ':' '$3 > 100 { print $1 }')
+ usermod -a -G systemd-journal r
+ for g in $(cat /etc/group | awk -F ':' '$3 > 100 { print $1 }')
+ usermod -a -G systemd-network r
+ for g in $(cat /etc/group | awk -F ':' '$3 > 100 { print $1 }')
+ usermod -a -G messagebus r
+ for g in $(cat /etc/group | awk -F ':' '$3 > 100 { print $1 }')
+ usermod -a -G _ssh r
+ for g in $(cat /etc/group | awk -F ':' '$3 > 100 { print $1 }')
+ usermod -a -G polkitd r
+ for g in $(cat /etc/group | awk -F ':' '$3 > 100 { print $1 }')
+ usermod -a -G ssh r
+ for g in $(cat /etc/group | awk -F ':' '$3 > 100 { print $1 }')
+ usermod -a -G docker r
+ for g in $(cat /etc/group | awk -F ':' '$3 > 100 { print $1 }')
+ usermod -a -G r r
+ usermod -s /bin/bash r
+ echo '%sudo ALL=(ALL) NOPASSWD:ALL'
+ cp -R /root/.bashrc /root/.cache /root/.gemrc /root/.gradle /root/.m2 /root/.profile /root/.ssh /root/.wget-hsts /home/r
+ cp -R ./cid ./end.sh ./entry.sh ./pid ./pubring.gpg ./repo ./run.sh ./script.sh ./secring.gpg ./settings.xml ./stdout /home/r
+ rm -rf repo
+ chown -R r:r /home/r
+ chmod a+x /home/r/script.sh
+ cat /home/r/script.sh
#!/usr/bin/env bash
set -e
set -o pipefail
if [ -e /home/r/.profile ]; then source /home/r/.profile; fi
shopt -s expand_aliases
alias 'sudo=sudo -i'
export HOME=/home/r
cd "${HOME}/repo"
export 'head=git@github.com:jcabi/jcabi-aspects.git' ; export 'pull_id=456' ; export 'fork=git@github.com:jcabi/jcabi-aspects.git' ; export 'fork_branch=renovate/com.qulice-qulice-maven-plugin-0.x' ; export 'head_branch=master' ; export 'pull_title=Update dependency com.qulice:qulice-maven-plugin to v0.36.0' ; export 'author=yegor256' ; pdd --file=/dev/null ; mvn clean install -ntp -Pqulice --errors --batch-mode ;
+ su --login r --command /home/r/script.sh
Found 7 lines in /home/r/repo/.pdd
My version is 0.23.1
Ruby version is 3.4.9 at x86_64-linux
Reading from root dir .
Excluding target/**/*
Excluding src/main/resources/images/**/*
/usr/local/bundle/gems/pdd-0.23.1/lib/pdd/sources.rb:90: warning: undefining the allocator of T_DATA class FileMagic
/home/r/repo/renovate.json is a binary file (107 bytes)
/home/r/repo/src/it/fake-validation/src/test/aspect/.gitkeep is a binary file (0 bytes)
/home/r/repo/src/it/loggable/src/test/aspect/.gitkeep is a binary file (0 bytes)
/home/r/repo/src/it/weaving/src/test/aspect/.gitkeep is a binary file (0 bytes)
Reading .0pdd.yml ...
Reading .gitattributes ...
Reading .github/workflows/actionlint.yml ...
Reading .github/workflows/codecov.yml ...
Reading .github/workflows/copyrights.yml ...
Reading .github/workflows/markdown-lint.yml ...
Reading .github/workflows/mvn.yml ...
Reading .github/workflows/pdd.yml ...
Reading .github/workflows/reuse.yml ...
Reading .github/workflows/typos.yml ...
Reading .github/workflows/xcop.yml ...
Reading .github/workflows/yamllint.yml ...
Reading .gitignore ...
Reading .pdd ...
Reading .rultor.yml ...
Reading LICENSE.txt ...
Reading LICENSES/MIT.txt ...
Reading README.md ...
Reading REUSE.toml ...
Reading pom.xml ...
Reading src/it/fake-validation/invoker.properties ...
Reading src/it/fake-validation/pom.xml ...
Reading src/it/fake-validation/src/main/aspect/README.txt ...
Reading src/it/fake-validation/src/main/java/com/jcabi/Foo.java ...
Reading src/it/fake-validation/src/main/resources/META-INF/services/javax.validation.spi.ValidationProvider ...
Reading src/it/fake-validation/src/test/java/com/jcabi/FooTest.java ...
Reading src/it/fake-validation/src/test/resources/log4j.properties ...
Reading src/it/fake-validation/verify.groovy ...
Reading src/it/loggable/aspect/README.txt ...
Reading src/it/loggable/invoker.properties ...
Reading src/it/loggable/pom.xml ...
Reading src/it/loggable/src/main/aspect/README.txt ...
Reading src/it/loggable/src/main/java/com/jcabi/LoggableThreading.java ...
Reading src/it/loggable/src/test/java/com/jcabi/LoggableThreadingTest.java ...
Reading src/it/loggable/src/test/resources/log4j.properties ...
Reading src/it/loggable/verify.groovy ...
Reading src/it/processor/invoker.properties ...
Reading src/it/processor/pom.xml ...
Reading src/it/processor/src/main/java/com/jcabi/AsyncInvalid.java ...
Reading src/it/processor/src/main/java/com/jcabi/AsyncValid.java ...
Reading src/it/processor/src/main/java/com/jcabi/QuietlyNonVoid.java ...
Reading src/it/processor/src/main/java/com/jcabi/QuietlyVoid.java ...
Reading src/it/processor/verify.groovy ...
Reading src/it/settings.xml ...
Reading src/it/weaving/invoker.properties ...
Reading src/it/weaving/pom.xml ...
Reading src/it/weaving/src/main/aspect/README.txt ...
Reading src/it/weaving/src/main/java/com/jcabi/Counter.java ...
Reading src/it/weaving/src/main/java/com/jcabi/Document.java ...
Reading src/it/weaving/src/main/java/com/jcabi/Page.java ...
Reading src/it/weaving/src/main/java/com/jcabi/StaticPage.java ...
Reading src/it/weaving/src/test/java/com/jcabi/CounterTest.java ...
Reading src/it/weaving/src/test/java/com/jcabi/DocumentTest.java ...
Reading src/it/weaving/src/test/java/com/jcabi/ImmutableAnnotationTest.java ...
Reading src/it/weaving/src/test/java/com/jcabi/PageTest.java ...
Reading src/it/weaving/src/test/java/com/jcabi/ParallelTest.java ...
Reading src/it/weaving/src/test/java/com/jcabi/StaticPageTest.java ...
Reading src/it/weaving/src/test/resources/log4j.properties ...
Reading src/it/weaving/verify.groovy ...
Reading src/main/java/com/jcabi/aspects/Async.java ...
Reading src/main/java/com/jcabi/aspects/Cacheable.java ...
Reading src/main/java/com/jcabi/aspects/FakeClockProvider.java ...
Reading src/main/java/com/jcabi/aspects/FakeConfiguration.java ...
Reading src/main/java/com/jcabi/aspects/FakeConstraintValidator.java ...
Reading src/main/java/com/jcabi/aspects/FakeConstraintValidatorFactory.java ...
Reading src/main/java/com/jcabi/aspects/FakeExecutableValidator.java ...
Reading src/main/java/com/jcabi/aspects/FakeMessageInterpolator.java ...
Reading src/main/java/com/jcabi/aspects/FakeParameterNameProvider.java ...
Reading src/main/java/com/jcabi/aspects/FakeTraversableResolver.java ...
Reading src/main/java/com/jcabi/aspects/FakeValidationProvider.java ...
Reading src/main/java/com/jcabi/aspects/FakeValidator.java ...
Reading src/main/java/com/jcabi/aspects/FakeValidatorContext.java ...
Reading src/main/java/com/jcabi/aspects/FakeValidatorFactory.java ...
Reading src/main/java/com/jcabi/aspects/Immutable.java ...
Puzzle 33-e5af3af3 0/DEV at src/main/java/com/jcabi/aspects/Immutable.java
Reading src/main/java/com/jcabi/aspects/LogExceptions.java ...
Reading src/main/java/com/jcabi/aspects/Loggable.java ...
Reading src/main/java/com/jcabi/aspects/Parallel.java ...
Reading src/main/java/com/jcabi/aspects/Quietly.java ...
Reading src/main/java/com/jcabi/aspects/RetryOnFailure.java ...
Reading src/main/java/com/jcabi/aspects/ScheduleWithFixedDelay.java ...
Reading src/main/java/com/jcabi/aspects/Timeable.java ...
Reading src/main/java/com/jcabi/aspects/UnitedThrow.java ...
Reading src/main/java/com/jcabi/aspects/aj/Call.java ...
Reading src/main/java/com/jcabi/aspects/aj/ExceptionsLogger.java ...
Reading src/main/java/com/jcabi/aspects/aj/ImmutabilityChecker.java ...
Reading src/main/java/com/jcabi/aspects/aj/ImprovedJoinPoint.java ...
Reading src/main/java/com/jcabi/aspects/aj/Key.java ...
Reading src/main/java/com/jcabi/aspects/aj/LogHelper.java ...
Reading src/main/java/com/jcabi/aspects/aj/Marker.java ...
Reading src/main/java/com/jcabi/aspects/aj/MethodAsyncRunner.java ...
Reading src/main/java/com/jcabi/aspects/aj/MethodCacher.java ...
Reading src/main/java/com/jcabi/aspects/aj/MethodInterrupter.java ...
Reading src/main/java/com/jcabi/aspects/aj/MethodLogger.java ...
Reading src/main/java/com/jcabi/aspects/aj/MethodScheduler.java ...
Reading src/main/java/com/jcabi/aspects/aj/MethodValidator.java ...
Reading src/main/java/com/jcabi/aspects/aj/Mnemos.java ...
Reading src/main/java/com/jcabi/aspects/aj/NamedThreads.java ...
Reading src/main/java/com/jcabi/aspects/aj/ParallelException.java ...
Reading src/main/java/com/jcabi/aspects/aj/Parallelizer.java ...
Reading src/main/java/com/jcabi/aspects/aj/QuietExceptionsLogger.java ...
Reading src/main/java/com/jcabi/aspects/aj/Repeater.java ...
Reading src/main/java/com/jcabi/aspects/aj/Service.java ...
Reading src/main/java/com/jcabi/aspects/aj/SingleException.java ...
Reading src/main/java/com/jcabi/aspects/aj/Tunnel.java ...
Reading src/main/java/com/jcabi/aspects/aj/Violation.java ...
Reading src/main/java/com/jcabi/aspects/aj/package-info.java ...
Reading src/main/java/com/jcabi/aspects/apt/AsyncReturnTypeProcessor.java ...
Reading src/main/java/com/jcabi/aspects/apt/QuietlyReturnTypeProcessor.java ...
Reading src/main/java/com/jcabi/aspects/apt/package-info.java ...
Reading src/main/java/com/jcabi/aspects/package-info.java ...
Reading src/main/java-templates/com/jcabi/aspects/version/Version.java ...
Reading src/main/java-templates/com/jcabi/aspects/version/package-info.java ...
Reading src/site/apt/annotation-async.apt.vm ...
Reading src/site/apt/annotation-cacheable.apt.vm ...
Reading src/site/apt/annotation-immutable.apt.vm ...
Reading src/site/apt/annotation-logexceptions.apt.vm ...
Reading src/site/apt/annotation-loggable.apt.vm ...
Reading src/site/apt/annotation-parallel.apt.vm ...
Reading src/site/apt/annotation-quietly.apt.vm ...
Reading src/site/apt/annotation-retryonfailure.apt.vm ...
Reading src/site/apt/annotation-schedulewithfixeddelay.apt.vm ...
Reading src/site/apt/annotation-timeable.apt.vm ...
Reading src/site/apt/annotation-unitedthrow.apt.vm ...
Reading src/site/apt/disable-jsr-303.vm ...
Reading src/site/apt/example-aspectj.apt.vm ...
Reading src/site/apt/example-weaving-ant.apt.vm ...
Reading src/site/apt/example-weaving-eclipse.apt.vm ...
Reading src/site/apt/example-weaving-gradle.apt.vm ...
Puzzle 210-9c505623 30/DEV at src/site/apt/example-weaving-gradle.apt.vm
Reading src/site/apt/example-weaving.apt.vm ...
Reading src/site/apt/immutable-collections.apt.vm ...
Reading src/site/apt/index.apt.vm ...
Reading src/site/apt/jsr-303.apt.vm ...
Reading src/site/resources/CNAME ...
Reading src/site/site.xml ...
Reading src/test/java/com/jcabi/aspects/AsyncTest.java ...
Reading src/test/java/com/jcabi/aspects/CacheableTest.java ...
Reading src/test/java/com/jcabi/aspects/ImmutableTest.java ...
Reading src/test/java/com/jcabi/aspects/JSR303Test.java ...
Reading src/test/java/com/jcabi/aspects/LoggableTest.java ...
Reading src/test/java/com/jcabi/aspects/RetryOnFailureTest.java ...
Reading src/test/java/com/jcabi/aspects/ScheduleWithFixedDelayTest.java ...
Reading src/test/java/com/jcabi/aspects/TimeableTest.java ...
Reading src/test/java/com/jcabi/aspects/UnitedThrowTest.java ...
Reading src/test/java/com/jcabi/aspects/aj/ImmutabilityCheckerTest.java ...
Reading src/test/java/com/jcabi/aspects/aj/MethodSchedulerTest.java ...
Reading src/test/java/com/jcabi/aspects/aj/MnemosTest.java ...
Reading src/test/java/com/jcabi/aspects/aj/NamedThreadsTest.java ...
Reading src/test/java/com/jcabi/aspects/aj/ParallelizerTest.java ...
Reading src/test/java/com/jcabi/aspects/aj/QuietExceptionsLoggerTest.java ...
Reading src/test/java/com/jcabi/aspects/aj/RepeaterTest.java ...
Reading src/test/java/com/jcabi/aspects/aj/package-info.java ...
Reading src/test/java/com/jcabi/aspects/apt/package-info.java ...
Reading src/test/java/com/jcabi/aspects/package-info.java ...
Reading src/test/java/com/jcabi/aspects/version/VersionTest.java ...
Reading src/test/java/com/jcabi/aspects/version/package-info.java ...
Reading src/test/resources/META-INF/validation.xml ...
Reading src/test/resources/log4j.properties ...
0m0m[INFO] Error stacktraces are turned on.
[INFO] Scanning for projects...
[INFO]
[INFO] ----------------------< com.jcabi:jcabi-aspects >-----------------------
[INFO] Building jcabi-aspects 1.0-SNAPSHOT
[INFO]   from pom.xml
[INFO] -------------------------------[ bundle ]-------------------------------
[INFO] Artifact log4j:log4j:jar:1.2.17 is present in the local repository, but cached from a remote repository ID that is unavailable in current build context, verifying that is downloadable from [central (https://repo.maven.apache.org/maven2, default, releases)]
[INFO] Artifact log4j:log4j:jar:1.2.17 is present in the local repository, but cached from a remote repository ID that is unavailable in current build context, verifying that is downloadable from [central (https://repo.maven.apache.org/maven2, default, releases)]
[INFO]
[INFO] --- clean:3.5.0:clean (default-clean) @ jcabi-aspects ---
[INFO]
[INFO] --- enforcer:3.6.3:enforce (enforce-maven) @ jcabi-aspects ---
[INFO] Rule 0: org.apache.maven.enforcer.rules.version.RequireMavenVersion passed
[INFO]
[INFO] --- enforcer:3.6.3:enforce (enforce-deps) @ jcabi-aspects ---
[INFO] Rule 0: org.apache.maven.enforcer.rules.dependency.RequireUpperBoundDeps passed
[INFO]
[INFO] --- buildnumber:3.3.0:create (jcabi-build-number) @ jcabi-aspects ---
[INFO] ShortRevision tag detected. The value is '7'.
[INFO] Storing buildNumber: 40a237f at timestamp: 2026-09-15T03:03:10
[INFO] Storing scmBranch: master
[INFO]
[INFO] --- buildnumber:3.3.0:create-timestamp (jcabi-build-number) @ jcabi-aspects ---
[INFO] Skipping because we are not in root module.
[INFO]
[INFO] --- resources:3.5.0:resources (default-resources) @ jcabi-aspects ---
[INFO] skip non existing resourceDirectory /home/r/repo/src/main/resources
[INFO]
[INFO] --- templating:3.0.0:filter-sources (default-cli) @ jcabi-aspects ---
[INFO] Copying files with filtering to temporary directory.
[INFO] Copying 2 resources from src/main/java-templates to target/templates-tmp215078179
[INFO] Copied 2 files to output directory: /home/r/repo/target/generated-sources/java-templates
[INFO] Source directory: /home/r/repo/target/generated-sources/java-templates added.
[INFO]
[INFO] --- compiler:3.15.0:compile (default-compile) @ jcabi-aspects ---
[INFO] Recompiling the module because of changed source code.
[INFO] Compiling 53 source files with javac [debug deprecation target 1.8] to target/classes
[INFO]
[INFO] --- aspectj:1.15.0:compile (jcabi-weave-classes) @ jcabi-aspects ---
[INFO] Showing AJC message detail for messages of types: [error, warning, fail]
[WARNING] bad version number found in /home/r/.m2/repository/org/aspectj/aspectjrt/1.9.25.1/aspectjrt-1.9.25.1.jar expected 1.9.7 found 1.9.25.1
        <unknown source file>:<no line information>

[INFO] Join point 'initialization(void com.jcabi.aspects.aj.QuietExceptionsLogger.<init>())' in Type 'com.jcabi.aspects.aj.QuietExceptionsLogger' (QuietExceptionsLogger.java:28) advised by after advice from 'com.jcabi.aspects.aj.ImmutabilityChecker' (ImmutabilityChecker.java:57)
[INFO] Join point 'initialization(void com.jcabi.aspects.aj.Repeater.<init>())' in Type 'com.jcabi.aspects.aj.Repeater' (Repeater.java:36) advised by after advice from 'com.jcabi.aspects.aj.ImmutabilityChecker' (ImmutabilityChecker.java:57)
[INFO] Join point 'initialization(void com.jcabi.aspects.aj.Parallelizer.<init>())' in Type 'com.jcabi.aspects.aj.Parallelizer' (Parallelizer.java:38) advised by after advice from 'com.jcabi.aspects.aj.ImmutabilityChecker' (ImmutabilityChecker.java:57)
[INFO] Join point 'initialization(void com.jcabi.aspects.aj.SingleException.<init>())' in Type 'com.jcabi.aspects.aj.SingleException' (SingleException.java:30) advised by after advice from 'com.jcabi.aspects.aj.ImmutabilityChecker' (ImmutabilityChecker.java:57)
[INFO] Join point 'initialization(void com.jcabi.aspects.aj.ExceptionsLogger.<init>())' in Type 'com.jcabi.aspects.aj.ExceptionsLogger' (ExceptionsLogger.java:28) advised by after advice from 'com.jcabi.aspects.aj.ImmutabilityChecker' (ImmutabilityChecker.java:57)
[INFO] Join point 'initialization(void com.jcabi.aspects.aj.Mnemos.<init>())' in Type 'com.jcabi.aspects.aj.Mnemos' (Mnemos.java:35) advised by after advice from 'com.jcabi.aspects.aj.ImmutabilityChecker' (ImmutabilityChecker.java:57)
[INFO]
[INFO] --- resources:3.5.0:testResources (default-testResources) @ jcabi-aspects ---
[INFO] Copying 2 resources from src/test/resources to target/test-classes
[INFO]
[INFO] --- compiler:3.15.0:testCompile (default-testCompile) @ jcabi-aspects ---
[INFO] Recompiling the module because of changed dependency.
[INFO] Compiling 17 source files with javac [debug deprecation target 1.8] to target/test-classes
[INFO]
[INFO] --- aspectj:1.15.0:test-compile (jcabi-weave-classes) @ jcabi-aspects ---
[INFO] Showing AJC message detail for messages of types: [error, warning, fail]
[WARNING] bad version number found in /home/r/.m2/repository/org/aspectj/aspectjrt/1.9.25.1/aspectjrt-1.9.25.1.jar expected 1.9.7 found 1.9.25.1
        <unknown source file>:<no line information>

[INFO] Join point 'method-execution(com.jcabi.aspects.LoggableTest$Foo com.jcabi.aspects.LoggableTest$Foo.self())' in Type 'com.jcabi.aspects.LoggableTest$Foo' (LoggableTest.java:226) advised by around advice from 'com.jcabi.aspects.aj.MethodLogger' (MethodLogger.class(from MethodLogger.java))
[INFO] Join point 'method-execution(java.lang.String com.jcabi.aspects.LoggableTest$Foo.revert(java.lang.String))' in Type 'com.jcabi.aspects.LoggableTest$Foo' (LoggableTest.java:238) advised by around advice from 'com.jcabi.aspects.aj.MethodLogger' (MethodLogger.class(from MethodLogger.java))
[INFO] Join point 'method-execution(java.lang.String com.jcabi.aspects.LoggableTest$Foo.revert(java.lang.String))' in Type 'com.jcabi.aspects.LoggableTest$Foo' (LoggableTest.java:238) advised by around advice from 'com.jcabi.aspects.aj.MethodInterrupter' (MethodInterrupter.class(from MethodInterrupter.java))
[INFO] Join point 'method-execution(byte[] com.jcabi.aspects.LoggableTest$Foo.logsByteArray())' in Type 'com.jcabi.aspects.LoggableTest$Foo' (LoggableTest.java:248) advised by around advice from 'com.jcabi.aspects.aj.MethodLogger' (MethodLogger.class(from MethodLogger.java))
[INFO] Join point 'method-execution(short[] com.jcabi.aspects.LoggableTest$Foo.logsShortArray())' in Type 'com.jcabi.aspects.LoggableTest$Foo' (LoggableTest.java:260) advised by around advice from 'com.jcabi.aspects.aj.MethodLogger' (MethodLogger.class(from MethodLogger.java))
[INFO] Join point 'method-execution(java.lang.String com.jcabi.aspects.LoggableTest$Foo.last(java.lang.String))' in Type 'com.jcabi.aspects.LoggableTest$Foo' (LoggableTest.java:276) advised by around advice from 'com.jcabi.aspects.aj.MethodLogger' (MethodLogger.class(from MethodLogger.java))
[INFO] Join point 'method-execution(java.lang.String com.jcabi.aspects.LoggableTest$Foo.text())' in Type 'com.jcabi.aspects.LoggableTest$Foo' (LoggableTest.java:287) advised by around advice from 'com.jcabi.aspects.aj.MethodInterrupter' (MethodInterrupter.class(from MethodInterrupter.java))
[INFO] Join point 'method-execution(java.lang.String com.jcabi.aspects.LoggableTest$Foo.explicitLoggerName())' in Type 'com.jcabi.aspects.LoggableTest$Foo' (LoggableTest.java:298) advised by around advice from 'com.jcabi.aspects.aj.MethodLogger' (MethodLogger.class(from MethodLogger.java))
[INFO] Join point 'method-execution(java.lang.String com.jcabi.aspects.LoggableTest$Foo.logsDurationInSeconds())' in Type 'com.jcabi.aspects.LoggableTest$Foo' (LoggableTest.java:309) advised by around advice from 'com.jcabi.aspects.aj.MethodLogger' (MethodLogger.class(from MethodLogger.java))
[INFO] Join point 'method-execution(void com.jcabi.aspects.LoggableTest$Foo.doThrow())' in Type 'com.jcabi.aspects.LoggableTest$Foo' (LoggableTest.java:319) advised by around advice from 'com.jcabi.aspects.aj.MethodLogger' (MethodLogger.class(from MethodLogger.java))
[INFO] Join point 'method-execution(void com.jcabi.aspects.LoggableTest$Bar.throwAtConfiguredLevel())' in Type 'com.jcabi.aspects.LoggableTest$Bar' (LoggableTest.java:335) advised by around advice from 'com.jcabi.aspects.aj.MethodLogger' (MethodLogger.class(from MethodLogger.java))
[INFO] Join point 'method-execution(void com.jcabi.aspects.aj.ParallelizerTest$3.run())' in Type 'com.jcabi.aspects.aj.ParallelizerTest$3' (ParallelizerTest.java:41) advised by around advice from 'com.jcabi.aspects.aj.Parallelizer' (Parallelizer.class(from Parallelizer.java))
[INFO] Join point 'method-execution(void com.jcabi.aspects.aj.ParallelizerTest$2.run())' in Type 'com.jcabi.aspects.aj.ParallelizerTest$2' (ParallelizerTest.java:27) advised by around advice from 'com.jcabi.aspects.aj.Parallelizer' (Parallelizer.class(from Parallelizer.java))
[INFO] Join point 'method-execution(java.lang.Boolean com.jcabi.aspects.aj.RepeaterTest$5.call())' in Type 'com.jcabi.aspects.aj.RepeaterTest$5' (RepeaterTest.java:72) advised by around advice from 'com.jcabi.aspects.aj.Repeater' (Repeater.class(from Repeater.java))
[INFO] Join point 'method-execution(java.lang.Boolean com.jcabi.aspects.aj.RepeaterTest$6.call())' in Type 'com.jcabi.aspects.aj.RepeaterTest$6' (RepeaterTest.java:94) advised by around advice from 'com.jcabi.aspects.aj.Repeater' (Repeater.class(from Repeater.java))
[INFO] Join point 'method-execution(java.lang.Boolean com.jcabi.aspects.aj.RepeaterTest$4.call())' in Type 'com.jcabi.aspects.aj.RepeaterTest$4' (RepeaterTest.java:51) advised by around advice from 'com.jcabi.aspects.aj.Repeater' (Repeater.class(from Repeater.java))
[INFO] Join point 'method-execution(java.lang.Boolean com.jcabi.aspects.aj.RepeaterTest$3.call())' in Type 'com.jcabi.aspects.aj.RepeaterTest$3' (RepeaterTest.java:30) advised by around advice from 'com.jcabi.aspects.aj.Repeater' (Repeater.class(from Repeater.java))
[INFO] Join point 'method-execution(java.lang.Boolean com.jcabi.aspects.aj.RepeaterTest$7.call())' in Type 'com.jcabi.aspects.aj.RepeaterTest$7' (RepeaterTest.java:115) advised by around advice from 'com.jcabi.aspects.aj.Repeater' (Repeater.class(from Repeater.java))
[INFO] Join point 'initialization(void com.jcabi.aspects.aj.ImmutabilityCheckerTest$Recursive.<init>(com.jcabi.aspects.aj.ImmutabilityCheckerTest$Recursive))' in Type 'com.jcabi.aspects.aj.ImmutabilityCheckerTest$Recursive' (ImmutabilityCheckerTest.java:77) advised by after advice from 'com.jcabi.aspects.aj.ImmutabilityChecker' (ImmutabilityChecker.class(from ImmutabilityChecker.java))
[INFO] Join point 'initialization(void com.jcabi.aspects.aj.ImmutabilityCheckerTest$Recursive.<init>(com.jcabi.aspects.aj.ImmutabilityCheckerTest$Recursive, com.jcabi.aspects.aj.ImmutabilityCheckerTest$Recursive))' in Type 'com.jcabi.aspects.aj.ImmutabilityCheckerTest$Recursive' (ImmutabilityCheckerTest.java:78) advised by after advice from 'com.jcabi.aspects.aj.ImmutabilityChecker' (ImmutabilityChecker.class(from ImmutabilityChecker.java))
[INFO] Join point 'initialization(void com.jcabi.aspects.aj.ImmutabilityCheckerTest$NonFinal.<init>(java.lang.String))' in Type 'com.jcabi.aspects.aj.ImmutabilityCheckerTest$NonFinal' (ImmutabilityCheckerTest.java:54) advised by after advice from 'com.jcabi.aspects.aj.ImmutabilityChecker' (ImmutabilityChecker.class(from ImmutabilityChecker.java))
[INFO] Join point 'initialization(void com.jcabi.aspects.aj.ImmutabilityCheckerTest$NonFinal.<init>(java.lang.String, com.jcabi.aspects.aj.ImmutabilityCheckerTest$NonFinal))' in Type 'com.jcabi.aspects.aj.ImmutabilityCheckerTest$NonFinal' (ImmutabilityCheckerTest.java:55) advised by after advice from 'com.jcabi.aspects.aj.ImmutabilityChecker' (ImmutabilityChecker.class(from ImmutabilityChecker.java))
[INFO] Join point 'method-execution(void com.jcabi.aspects.aj.MethodSchedulerTest$ShortRun.close())' in Type 'com.jcabi.aspects.aj.MethodSchedulerTest$ShortRun' (MethodSchedulerTest.java:83) advised by before advice from 'com.jcabi.aspects.aj.MethodScheduler' (MethodScheduler.class(from MethodScheduler.java))
[INFO] Join point 'initialization(void com.jcabi.aspects.aj.MethodSchedulerTest$ShortRun.<init>(java.util.concurrent.atomic.AtomicBoolean))' in Type 'com.jcabi.aspects.aj.MethodSchedulerTest$ShortRun' (MethodSchedulerTest.java:68) advised by after advice from 'com.jcabi.aspects.aj.MethodScheduler' (MethodScheduler.class(from MethodScheduler.java))
[INFO] Join point 'method-execution(void com.jcabi.aspects.aj.MethodSchedulerTest$LongRun.close())' in Type 'com.jcabi.aspects.aj.MethodSchedulerTest$LongRun' (MethodSchedulerTest.java:124) advised by before advice from 'com.jcabi.aspects.aj.MethodScheduler' (MethodScheduler.class(from MethodScheduler.java))
[INFO] Join point 'initialization(void com.jcabi.aspects.aj.MethodSchedulerTest$LongRun.<init>(java.util.concurrent.atomic.AtomicBoolean))' in Type 'com.jcabi.aspects.aj.MethodSchedulerTest$LongRun' (MethodSchedulerTest.java:109) advised by after advice from 'com.jcabi.aspects.aj.MethodScheduler' (MethodScheduler.class(from MethodScheduler.java))
[INFO] Join point 'method-execution(void com.jcabi.aspects.RetryOnFailureTest$1.run())' in Type 'com.jcabi.aspects.RetryOnFailureTest$1' (RetryOnFailureTest.java:26) advised by around advice from 'com.jcabi.aspects.aj.Repeater' (Repeater.class(from Repeater.java))
[INFO] Join point 'method-execution(void com.jcabi.aspects.RetryOnFailureTest$2.run())' in Type 'com.jcabi.aspects.RetryOnFailureTest$2' (RetryOnFailureTest.java:43) advised by around advice from 'com.jcabi.aspects.aj.Repeater' (Repeater.class(from Repeater.java))
[INFO] Join point 'initialization(void com.jcabi.aspects.ImmutableTest$TrulyImmutableWithNonPrivateFields.<init>())' in Type 'com.jcabi.aspects.ImmutableTest$TrulyImmutableWithNonPrivateFields' (ImmutableTest.java:224) advised by after advice from 'com.jcabi.aspects.aj.ImmutabilityChecker' (ImmutabilityChecker.class(from ImmutabilityChecker.java))
[INFO] Join point 'initialization(void com.jcabi.aspects.ImmutableTest$TrulyImmutableWithNonPrivateFields.<init>(com.jcabi.aspects.ImmutableTest$TrulyImmutableWithNonPrivateFields))' in Type 'com.jcabi.aspects.ImmutableTest$TrulyImmutableWithNonPrivateFields' (ImmutableTest.java:224) advised by after advice from 'com.jcabi.aspects.aj.ImmutabilityChecker' (ImmutabilityChecker.class(from ImmutabilityChecker.java))
[INFO] Join point 'initialization(void com.jcabi.aspects.ImmutableTest$TrulyImmutable.<init>())' in Type 'com.jcabi.aspects.ImmutableTest$TrulyImmutable' (ImmutableTest.java:175) advised by after advice from 'com.jcabi.aspects.aj.ImmutabilityChecker' (ImmutabilityChecker.class(from ImmutabilityChecker.java))
[INFO] Join point 'initialization(void com.jcabi.aspects.ImmutableTest$TrulyImmutable.<init>(com.jcabi.aspects.ImmutableTest$TrulyImmutableWithNonPrivateFields))' in Type 'com.jcabi.aspects.ImmutableTest$TrulyImmutable' (ImmutableTest.java:184) advised by after advice from 'com.jcabi.aspects.aj.ImmutabilityChecker' (ImmutabilityChecker.class(from ImmutabilityChecker.java))
[INFO] Join point 'initialization(void com.jcabi.aspects.ImmutableTest$TrulyImmutable.<init>(java.lang.String))' in Type 'com.jcabi.aspects.ImmutableTest$TrulyImmutable' (ImmutableTest.java:193) advised by after advice from 'com.jcabi.aspects.aj.ImmutabilityChecker' (ImmutabilityChecker.class(from ImmutabilityChecker.java))
[INFO] Join point 'initialization(void com.jcabi.aspects.ImmutableTest$TrulyImmutable.<init>(com.jcabi.aspects.ImmutableTest$TrulyImmutableWithNonPrivateFields, com.jcabi.aspects.ImmutableTest$TrulyImmutable))' in Type 'com.jcabi.aspects.ImmutableTest$TrulyImmutable' (ImmutableTest.java:194) advised by after advice from 'com.jcabi.aspects.aj.ImmutabilityChecker' (ImmutabilityChecker.class(from ImmutabilityChecker.java))
[INFO] Join point 'initialization(void com.jcabi.aspects.ImmutableTest$MutableWithArray.<init>())' in Type 'com.jcabi.aspects.ImmutableTest$MutableWithArray' (ImmutableTest.java:125) advised by after advice from 'com.jcabi.aspects.aj.ImmutabilityChecker' (ImmutabilityChecker.class(from ImmutabilityChecker.java))
[INFO] Join point 'initialization(void com.jcabi.aspects.ImmutableTest$MutableWithArray.<init>(com.jcabi.aspects.ImmutableTest$MutableWithArray))' in Type 'com.jcabi.aspects.ImmutableTest$MutableWithArray' (ImmutableTest.java:125) advised by after advice from 'com.jcabi.aspects.aj.ImmutabilityChecker' (ImmutabilityChecker.class(from ImmutabilityChecker.java))
[INFO] Join point 'initialization(void com.jcabi.aspects.ImmutableTest$MutableByInheritance.<init>())' in Type 'com.jcabi.aspects.ImmutableTest$MutableByInheritance' (ImmutableTest.java:262) advised by after advice from 'com.jcabi.aspects.aj.ImmutabilityChecker' (ImmutabilityChecker.class(from ImmutabilityChecker.java))
[INFO] Join point 'initialization(void com.jcabi.aspects.ImmutableTest$MutableByInheritance.<init>(com.jcabi.aspects.ImmutableTest$MutableByInheritance))' in Type 'com.jcabi.aspects.ImmutableTest$MutableByInheritance' (ImmutableTest.java:262) advised by after advice from 'com.jcabi.aspects.aj.ImmutabilityChecker' (ImmutabilityChecker.class(from ImmutabilityChecker.java))
[INFO] Join point 'initialization(void com.jcabi.aspects.ImmutableTest$Mutable.&lt;init&gt;())' in Type 'com.jcabi.aspects.ImmutableTest$Mutable' (ImmutableTest.java:111) advised by after advice from 'com.jcabi.aspects.aj.ImmutabilityChecker' (ImmutabilityChecker.class(from ImmutabilityChecker.java))
[INFO] Join point 'initialization(void com.jcabi.aspects.ImmutableTest$Mutable.<init>(com.jcabi.aspects.ImmutableTest$Mutable))' in Type 'com.jcabi.aspects.ImmutableTest$Mutable' (ImmutableTest.java:111) advised by after advice from 'com.jcabi.aspects.aj.ImmutabilityChecker' (ImmutabilityChecker.class(from ImmutabilityChecker.java))
[INFO] Join point 'method-execution(void com.jcabi.aspects.UnitedThrowTest$Thrower.save())' in Type 'com.jcabi.aspects.UnitedThrowTest$Thrower' (UnitedThrowTest.java:77) advised by around advice from 'com.jcabi.aspects.aj.SingleException' (SingleException.class(from SingleException.java))
[INFO] Join point 'method-execution(void com.jcabi.aspects.UnitedThrowTest$Thrower.file())' in Type 'com.jcabi.aspects.UnitedThrowTest$Thrower' (UnitedThrowTest.java:87) advised by around advice from 'com.jcabi.aspects.aj.SingleException' (SingleException.class(from SingleException.java))
[INFO] Join point 'method-execution(void com.jcabi.aspects.UnitedThrowTest$Thrower.multiple())' in Type 'com.jcabi.aspects.UnitedThrowTest$Thrower' (UnitedThrowTest.java:95) advised by around advice from 'com.jcabi.aspects.aj.SingleException' (SingleException.class(from SingleException.java))
[INFO] Join point 'method-execution(void com.jcabi.aspects.UnitedThrowTest$Thrower.def())' in Type 'com.jcabi.aspects.UnitedThrowTest$Thrower' (UnitedThrowTest.java:103) advised by around advice from 'com.jcabi.aspects.aj.SingleException' (SingleException.class(from SingleException.java))
[INFO] Join point 'method-execution(void com.jcabi.aspects.UnitedThrowTest$Thrower.encapsulate())' in Type 'com.jcabi.aspects.UnitedThrowTest$Thrower' (UnitedThrowTest.java:111) advised by around advice from 'com.jcabi.aspects.aj.SingleException' (SingleException.class(from SingleException.java))
[INFO] Join point 'method-execution(java.util.concurrent.Future com.jcabi.aspects.AsyncTest$Foo.asyncMethodWithReturnValue())' in Type 'com.jcabi.aspects.AsyncTest$Foo' (AsyncTest.java:79) advised by around advice from 'com.jcabi.aspects.aj.MethodAsyncRunner' (MethodAsyncRunner.class(from MethodAsyncRunner.java))
[INFO] Join point 'method-execution(int com.jcabi.aspects.AsyncTest$Foo.asyncMethodThatReturnsInt())' in Type 'com.jcabi.aspects.AsyncTest$Foo' (AsyncTest.java:117) advised by around advice from 'com.jcabi.aspects.aj.MethodAsyncRunner' (MethodAsyncRunner.class(from MethodAsyncRunner.java))
[INFO] Join point 'method-execution(void com.jcabi.aspects.AsyncTest$1.run())' in Type 'com.jcabi.aspects.AsyncTest$1' (AsyncTest.java:38) advised by around advice from 'com.jcabi.aspects.aj.MethodAsyncRunner' (MethodAsyncRunner.class(from MethodAsyncRunner.java))
[INFO] Join point 'method-execution(long com.jcabi.aspects.CacheableTest$Bar.get())' in Type 'com.jcabi.aspects.CacheableTest$Bar' (CacheableTest.java:263) advised by around advice from 'com.jcabi.aspects.aj.MethodCacher' (MethodCacher.class(from MethodCacher.java))
[INFO] Join point 'method-execution(java.lang.String com.jcabi.aspects.CacheableTest$Foo.toString())' in Type 'com.jcabi.aspects.CacheableTest$Foo' (CacheableTest.java:172) advised by around advice from 'com.jcabi.aspects.aj.MethodLogger' (MethodLogger.class(from MethodLogger.java))
[INFO] Join point 'method-execution(java.lang.String com.jcabi.aspects.CacheableTest$Foo.toString())' in Type 'com.jcabi.aspects.CacheableTest$Foo' (CacheableTest.java:172) advised by around advice from 'com.jcabi.aspects.aj.MethodCacher' (MethodCacher.class(from MethodCacher.java))
[INFO] Join point 'method-execution(com.jcabi.aspects.CacheableTest$Foo com.jcabi.aspects.CacheableTest$Foo.get())' in Type 'com.jcabi.aspects.CacheableTest$Foo' (CacheableTest.java:183) advised by around advice from 'com.jcabi.aspects.aj.MethodLogger' (MethodLogger.class(from MethodLogger.java))
[INFO] Join point 'method-execution(com.jcabi.aspects.CacheableTest$Foo com.jcabi.aspects.CacheableTest$Foo.get())' in Type 'com.jcabi.aspects.CacheableTest$Foo' (CacheableTest.java:183) advised by around advice from 'com.jcabi.aspects.aj.MethodCacher' (MethodCacher.class(from MethodCacher.java))
[INFO] Join point 'method-execution(com.jcabi.aspects.CacheableTest$Foo com.jcabi.aspects.CacheableTest$Foo.asyncGet())' in Type 'com.jcabi.aspects.CacheableTest$Foo' (CacheableTest.java:194) advised by around advice from 'com.jcabi.aspects.aj.MethodLogger' (MethodLogger.class(from MethodLogger.java))
[INFO] Join point 'method-execution(com.jcabi.aspects.CacheableTest$Foo com.jcabi.aspects.CacheableTest$Foo.asyncGet())' in Type 'com.jcabi.aspects.CacheableTest$Foo' (CacheableTest.java:194) advised by around advice from 'com.jcabi.aspects.aj.MethodCacher' (MethodCacher.class(from MethodCacher.java))
[INFO] Join point 'method-execution(com.jcabi.aspects.CacheableTest$Foo com.jcabi.aspects.CacheableTest$Foo.never())' in Type 'com.jcabi.aspects.CacheableTest$Foo' (CacheableTest.java:205) advised by around advice from 'com.jcabi.aspects.aj.MethodLogger' (MethodLogger.class(from MethodLogger.java))
[INFO] Join point 'method-execution(com.jcabi.aspects.CacheableTest$Foo com.jcabi.aspects.CacheableTest$Foo.never())' in Type 'com.jcabi.aspects.CacheableTest$Foo' (CacheableTest.java:205) advised by around advice from 'com.jcabi.aspects.aj.MethodCacher' (MethodCacher.class(from MethodCacher.java))
[INFO] Join point 'method-execution(void com.jcabi.aspects.CacheableTest$Foo.flush())' in Type 'com.jcabi.aspects.CacheableTest$Foo' (CacheableTest.java:218) advised by before advice from 'com.jcabi.aspects.aj.MethodCacher' (MethodCacher.class(from MethodCacher.java))
[INFO] Join point 'method-execution(java.lang.String com.jcabi.aspects.CacheableTest$Foo.staticGet())' in Type 'com.jcabi.aspects.CacheableTest$Foo' (CacheableTest.java:228) advised by around advice from 'com.jcabi.aspects.aj.MethodCacher' (MethodCacher.class(from MethodCacher.java))
[INFO] Join point 'method-execution(void com.jcabi.aspects.CacheableTest$Foo.staticFlush())' in Type 'com.jcabi.aspects.CacheableTest$Foo' (CacheableTest.java:236) advised by before advice from 'com.jcabi.aspects.aj.MethodCacher' (MethodCacher.class(from MethodCacher.java))
[INFO] Join point 'method-execution(void com.jcabi.aspects.TimeableTest.slow())' in Type 'com.jcabi.aspects.TimeableTest' (TimeableTest.java:32) advised by around advice from 'com.jcabi.aspects.aj.MethodInterrupter' (MethodInterrupter.class(from MethodInterrupter.java))
[INFO] Join point 'method-execution(void com.jcabi.aspects.ScheduleWithFixedDelayTest$LongDelaySample.close())' in Type 'com.jcabi.aspects.ScheduleWithFixedDelayTest$LongDelaySample' (ScheduleWithFixedDelayTest.java:127) advised by before advice from 'com.jcabi.aspects.aj.MethodScheduler' (MethodScheduler.class(from MethodScheduler.java))
[INFO] Join point 'initialization(void com.jcabi.aspects.ScheduleWithFixedDelayTest$LongDelaySample.<init>(java.util.concurrent.atomic.AtomicLong))' in Type 'com.jcabi.aspects.ScheduleWithFixedDelayTest$LongDelaySample' (ScheduleWithFixedDelayTest.java:117) advised by after advice from 'com.jcabi.aspects.aj.MethodScheduler' (MethodScheduler.class(from MethodScheduler.java))
[INFO] Join point 'method-execution(void com.jcabi.aspects.ScheduleWithFixedDelayTest$Sample.close())' in Type 'com.jcabi.aspects.ScheduleWithFixedDelayTest$Sample' (ScheduleWithFixedDelayTest.java:94) advised by before advice from 'com.jcabi.aspects.aj.MethodScheduler' (MethodScheduler.class(from MethodScheduler.java))
[INFO] Join point 'initialization(void com.jcabi.aspects.ScheduleWithFixedDelayTest$Sample.<init>(java.util.concurrent.atomic.AtomicLong))' in Type 'com.jcabi.aspects.ScheduleWithFixedDelayTest$Sample' (ScheduleWithFixedDelayTest.java:84) advised by after advice from 'com.jcabi.aspects.aj.MethodScheduler' (MethodScheduler.class(from MethodScheduler.java))
[INFO] Join point 'method-execution(int com.jcabi.aspects.JSR303Test$Foo.foo(java.lang.String))' in Type 'com.jcabi.aspects.JSR303Test$Foo' (JSR303Test.java:158) advised by before advice from 'com.jcabi.aspects.aj.MethodValidator' (MethodValidator.class(from MethodValidator.java))
[INFO] Join point 'method-execution(java.lang.Integer com.jcabi.aspects.JSR303Test$Foo.nullValue())' in Type 'com.jcabi.aspects.JSR303Test$Foo' (JSR303Test.java:172) advised by afterReturning advice from 'com.jcabi.aspects.aj.MethodValidator' (MethodValidator.class(from MethodValidator.java))
[INFO] Join point 'preinitialization(void com.jcabi.aspects.JSR303Test$ConstructorValidation.<init>(java.lang.String))' in Type 'com.jcabi.aspects.JSR303Test$ConstructorValidation' (JSR303Test.java:197) advised by before advice from 'com.jcabi.aspects.aj.MethodValidator' (MethodValidator.class(from MethodValidator.java))
[INFO] Join point 'preinitialization(void com.jcabi.aspects.JSR303Test$ConstructorValidation.<init>(java.lang.String, java.lang.String))' in Type 'com.jcabi.aspects.JSR303Test$ConstructorValidation' (JSR303Test.java:208) advised by before advice from 'com.jcabi.aspects.aj.MethodValidator' (MethodValidator.class(from MethodValidator.java))
[INFO] Join point 'method-execution(void com.jcabi.aspects.JSR303Test$Bar.test(java.lang.String))' in Type 'com.jcabi.aspects.JSR303Test$Bar' (JSR303Test.java:225) advised by around advice from 'com.jcabi.aspects.aj.MethodLogger' (MethodLogger.class(from MethodLogger.java)) [with runtime test]
[INFO] Join point 'method-execution(void com.jcabi.aspects.JSR303Test$Bar.test(java.lang.String))' in Type 'com.jcabi.aspects.JSR303Test$Bar' (JSR303Test.java:225) advised by before advice from 'com.jcabi.aspects.aj.MethodValidator' (MethodValidator.class(from MethodValidator.java))
[INFO]
[INFO] --- surefire:3.5.6:test (default-test) @ jcabi-aspects ---
[INFO] Tests will run in random order. To reproduce ordering use flag -Dsurefire.runOrder.random.seed=359154280735
[INFO] Surefire report directory: /home/r/repo/target/surefire-reports
[INFO] Using auto detected provider org.apache.maven.surefire.junitplatform.JUnitPlatformProvider
[INFO]
[INFO] -------------------------------------------------------
[INFO]  T E S T S
[INFO] -------------------------------------------------------
[INFO] Running com.jcabi.aspects.aj.ParallelizerTest
[DEBUG] main com.jcabi.aspects.aj.ImmutabilityChecker: #check(class com.jcabi.aspects.aj.Parallelizer): immutability checked
[INFO] Tests run: 2, Failures: 0, Errors: 0, Skipped: 0, Time elapsed: 0.363 s -- in com.jcabi.aspects.aj.ParallelizerTest
[INFO] Running com.jcabi.aspects.AsyncTest
[INFO] main com.jcabi.aspects.aj.NamedThreads: jcabi-aspects 1.0-SNAPSHOT/40a237f started new daemon thread jcabi-async for Asynchronous method execution
[INFO] Tests run: 3, Failures: 0, Errors: 0, Skipped: 0, Time elapsed: 0.060 s -- in com.jcabi.aspects.AsyncTest
[INFO] Running com.jcabi.aspects.version.VersionTest
[INFO] Tests run: 2, Failures: 0, Errors: 0, Skipped: 0, Time elapsed: 0.024 s -- in com.jcabi.aspects.version.VersionTest
[INFO] Running com.jcabi.aspects.TimeableTest
[INFO] main com.jcabi.aspects.aj.NamedThreads: jcabi-aspects 1.0-SNAPSHOT/40a237f started new daemon thread jcabi-timeable for interrupting of @Timeable annotated methods
[INFO] Tests run: 1, Failures: 0, Errors: 0, Skipped: 0, Time elapsed: 1.019 s -- in com.jcabi.aspects.TimeableTest
[INFO] Running com.jcabi.aspects.JSR303Test
[WARN] jcabi-timeable com.jcabi.aspects.TimeableTest: #slow(): interrupted on 1s timeout (over 1ms)
[INFO] main com.jcabi.aspects.aj.NamedThreads: jcabi-aspects 1.0-SNAPSHOT/40a237f started new daemon thread jcabi-loggable for watching of @Loggable annotated methods
[INFO] main com.jcabi.aspects.JSR303Test$Bar: #test('value'): in 237.96µs
[WARNING] Tests run: 9, Failures: 0, Errors: 0, Skipped: 2, Time elapsed: 0.592 s -- in com.jcabi.aspects.JSR303Test
[INFO] Running com.jcabi.aspects.aj.MnemosTest
[INFO] Tests run: 8, Failures: 0, Errors: 0, Skipped: 0, Time elapsed: 0.053 s -- in com.jcabi.aspects.aj.MnemosTest
[INFO] Running com.jcabi.aspects.LoggableTest
[INFO] main com.jcabi.aspects.LoggableTest$Foo: #logsShortArray(): [24719, -14367, 18028, -22993, -31155, 22034, -19355, -18038, 5933, 15248] in 37.98µs
[INFO] main com.jcabi.aspects.LoggableTest$Foo: #logsByteArray(): [-57, 68, 83, -117, 27, -34, -67, 70, -85, 27] in 35.69µs
[INFO] main com.jcabi.aspects.LoggableTest$Foo: some text#last('TEST'): 'T' in 21.66µs
[DEBUG] main test-logger: #explicitLoggerName(): entered
[DEBUG] main test-logger: #explicitLoggerName(): 'some static text' in 183.12µs
[INFO] main com.jcabi.aspects.LoggableTest$Foo: #revert('hello'): 'olleh' in 17.71µs
[ERROR] main com.jcabi.aspects.LoggableTest$Bar: #throwAtConfiguredLevel(): thrown java.lang.IllegalStateException(test) out of com.jcabi.aspects.LoggableTest$Bar#throwAtConfiguredLevel_aroundBody0[336] in 768µs
[DEBUG] jcabi-loggable com.jcabi.aspects.aj.MethodLogger$1: Logging monitor thread interrupted
[INFO] main com.jcabi.aspects.LoggableTest$Foo: #logsDurationInSeconds(): 'some static text' in 2.000s
[INFO] main com.jcabi.aspects.LoggableTest$Foo: #self(): 'some text' in 25.76µs
[INFO] Tests run: 11, Failures: 0, Errors: 0, Skipped: 0, Time elapsed: 4.084 s -- in com.jcabi.aspects.LoggableTest
[INFO] Running com.jcabi.aspects.aj.NamedThreadsTest
[INFO] main com.jcabi.aspects.aj.NamedThreads: jcabi-aspects 1.0-SNAPSHOT/40a237f started new daemon thread jcabi-test for desc
[INFO] Tests run: 1, Failures: 0, Errors: 0, Skipped: 0, Time elapsed: 0.006 s -- in com.jcabi.aspects.aj.NamedThreadsTest
[INFO] Running com.jcabi.aspects.aj.MethodSchedulerTest
[INFO] main com.jcabi.aspects.aj.MethodSchedulerTest$LongRun: scheduled for execution with 1 NANOSECONDS interval
[INFO] main com.jcabi.aspects.aj.MethodSchedulerTest$LongRun: execution stopped after 8ms and 0 tick(s)
[INFO] main com.jcabi.aspects.aj.MethodSchedulerTest$ShortRun: scheduled for execution with 1 NANOSECONDS interval
[INFO] main com.jcabi.aspects.aj.MethodSchedulerTest$ShortRun: execution stopped after 5s and 5 tick(s)
[INFO] Tests run: 2, Failures: 0, Errors: 0, Skipped: 0, Time elapsed: 5.020 s -- in com.jcabi.aspects.aj.MethodSchedulerTest
[INFO] Running com.jcabi.aspects.aj.RepeaterTest
[DEBUG] main com.jcabi.aspects.aj.ImmutabilityChecker: #check(class com.jcabi.aspects.aj.Repeater): immutability checked
[WARN] main com.jcabi.aspects.aj.RepeaterTest$5: #call(): attempt #1/3 failed with java.lang.ArrayIndexOutOfBoundsException in 103µs (108µs in total): null
[WARN] main com.jcabi.aspects.aj.RepeaterTest$5: #call(): attempt #2/3 failed with java.lang.ArrayIndexOutOfBoundsException in 72µs (158ms in total): null
[WARN] main com.jcabi.aspects.aj.RepeaterTest$3: #call(): attempt #1/3 failed with java.lang.IllegalStateException in 45µs (47µs in total): null
[WARN] main com.jcabi.aspects.aj.RepeaterTest$3: #call(): attempt #2/3 failed with java.lang.IllegalStateException in 87µs (102ms in total): null
[WARN] main com.jcabi.aspects.aj.RepeaterTest$4: #call(): attempt #1/3 failed with java.lang.IllegalStateException in 46µs (48µs in total): null
[WARN] main com.jcabi.aspects.aj.RepeaterTest$4: #call(): attempt #2/3 failed with java.lang.IllegalStateException in 30µs (869µs in total): null
[WARN] main com.jcabi.aspects.aj.RepeaterTest$4: #call(): attempt #3/3 failed with java.lang.IllegalStateException in 88µs (351ms in total): null
[WARN] main com.jcabi.aspects.aj.RepeaterTest$7: #call(): attempt #1/3 failed with java.lang.ArrayIndexOutOfBoundsException in 47µs (49µs in total): null
[WARN] main com.jcabi.aspects.aj.RepeaterTest$7: #call(): attempt #2/3 failed with java.lang.ArrayIndexOutOfBoundsException in 86µs (151ms in total): null
[INFO] Tests run: 5, Failures: 0, Errors: 0, Skipped: 0, Time elapsed: 1.647 s -- in com.jcabi.aspects.aj.RepeaterTest
[INFO] Running com.jcabi.aspects.aj.QuietExceptionsLoggerTest
Mockito is currently self-attaching to enable the inline-mock-maker. This will no longer work in future releases of the JDK. Please add Mockito as an agent to your build as described in Mockito's documentation: https://javadoc.io/doc/org.mockito/mockito-core/latest/org.mockito/org/mockito/Mockito.html#0.3
WARNING: A Java agent has been loaded dynamically (/home/r/.m2/repository/net/bytebuddy/byte-buddy-agent/1.17.7/byte-buddy-agent-1.17.7.jar)
WARNING: If a serviceability tool is in use, please run with -XX:+EnableDynamicAgentLoading to hide this warning
WARNING: If a serviceability tool is not in use, please run with -Djdk.instrument.traceUsage for more information
WARNING: Dynamic loading of agents will be disallowed by default in a future release
OpenJDK 64-Bit Server VM warning: Sharing is only supported for boot loader classes because bootstrap classpath has been appended
[DEBUG] main com.jcabi.aspects.aj.ImmutabilityChecker: #check(class com.jcabi.aspects.aj.QuietExceptionsLogger): immutability checked
[WARN] main java.lang.Object: java.lang.Exception
        at com.jcabi.aspects.aj.QuietExceptionsLogger.wrap(QuietExceptionsLogger.java:62)
        at com.jcabi.aspects.aj.QuietExceptionsLoggerTest.exception(QuietExceptionsLoggerTest.java:47)
        at java.base/jdk.internal.reflect.DirectMethodHandleAccessor.invoke(DirectMethodHandleAccessor.java:103)
        at java.base/java.lang.reflect.Method.invoke(Method.java:580)
        at org.junit.platform.commons.util.ReflectionUtils.invokeMethod(ReflectionUtils.java:700)
        at org.junit.platform.commons.support.ReflectionSupport.invokeMethod(ReflectionSupport.java:528)
        at org.junit.jupiter.engine.support.MethodReflectionUtils.invoke(MethodReflectionUtils.java:53)
        at org.junit.jupiter.engine.execution.MethodInvocation.proceed(MethodInvocation.java:61)
        at org.junit.jupiter.engine.execution.InvocationInterceptorChain$ValidatingInvocation.proceed(InvocationInterceptorChain.java:124)
        at org.junit.jupiter.engine.extension.TimeoutExtension.intercept(TimeoutExtension.java:163)
        at org.junit.jupiter.engine.extension.TimeoutExtension.interceptTestableMethod(TimeoutExtension.java:148)
        at org.junit.jupiter.engine.extension.TimeoutExtension.interceptTestMethod(TimeoutExtension.java:86)
        at org.junit.jupiter.engine.execution.InterceptingExecutableInvoker$ReflectiveInterceptorCall.lambda$ofVoidMethod$0(InterceptingExecutableInvoker.java:124)
        at org.junit.jupiter.engine.execution.InterceptingExecutableInvoker.lambda$invoke$0(InterceptingExecutableInvoker.java:105)
        at org.junit.jupiter.engine.execution.InvocationInterceptorChain$InterceptedInvocation.proceed(InvocationInterceptorChain.java:99)
        at org.junit.jupiter.engine.execution.InvocationInterceptorChain.proceed(InvocationInterceptorChain.java:66)
        at org.junit.jupiter.engine.execution.InvocationInterceptorChain.chainAndInvoke(InvocationInterceptorChain.java:47)
        at org.junit.jupiter.engine.execution.InvocationInterceptorChain.invoke(InvocationInterceptorChain.java:39)
        at org.junit.jupiter.engine.execution.InterceptingExecutableInvoker.invoke(InterceptingExecutableInvoker.java:104)
        at org.junit.jupiter.engine.execution.InterceptingExecutableInvoker.invoke(InterceptingExecutableInvoker.java:98)
        at org.junit.jupiter.engine.execution.InterceptingExecutableInvoker.invokeVoid(InterceptingExecutableInvoker.java:71)
        at org.junit.jupiter.engine.descriptor.TestMethodTestDescriptor.lambda$invokeTestMethod$0(TestMethodTestDescriptor.java:219)
        at org.junit.platform.engine.support.hierarchical.ThrowableCollector.execute(ThrowableCollector.java:74)
        at org.junit.jupiter.engine.descriptor.TestMethodTestDescriptor.invokeTestMethod(TestMethodTestDescriptor.java:215)
        at org.junit.jupiter.engine.descriptor.TestMethodTestDescriptor.execute(TestMethodTestDescriptor.java:157)
        at org.junit.jupiter.engine.descriptor.TestMethodTestDescriptor.execute(TestMethodTestDescriptor.java:70)
        at org.junit.platform.engine.support.hierarchical.NodeTestTask.lambda$executeRecursively$2(NodeTestTask.java:176)
        at org.junit.platform.engine.support.hierarchical.ThrowableCollector.execute(ThrowableCollector.java:74)
        at org.junit.platform.engine.support.hierarchical.NodeTestTask.lambda$executeRecursively$1(NodeTestTask.java:166)
        at org.junit.platform.engine.support.hierarchical.Node.around(Node.java:139)
        at org.junit.platform.engine.support.hierarchical.NodeTestTask.lambda$executeRecursively$0(NodeTestTask.java:164)
        at org.junit.platform.engine.support.hierarchical.ThrowableCollector.execute(ThrowableCollector.java:74)
        at org.junit.platform.engine.support.hierarchical.NodeTestTask.executeRecursively(NodeTestTask.java:163)
        at org.junit.platform.engine.support.hierarchical.NodeTestTask.execute(NodeTestTask.java:116)
        at java.base/java.util.ArrayList.forEach(ArrayList.java:1596)
        at org.junit.platform.engine.support.hierarchical.SameThreadHierarchicalTestExecutorService.invokeAll(SameThreadHierarchicalTestExecutorService.java:42)
        at org.junit.platform.engine.support.hierarchical.NodeTestTask.lambda$executeRecursively$2(NodeTestTask.java:180)
        at org.junit.platform.engine.support.hierarchical.ThrowableCollector.execute(ThrowableCollector.java:74)
        at org.junit.platform.engine.support.hierarchical.NodeTestTask.lambda$executeRecursively$1(NodeTestTask.java:166)
        at org.junit.platform.engine.support.hierarchical.Node.around(Node.java:139)
        at org.junit.platform.engine.support.hierarchical.NodeTestTask.lambda$executeRecursively$0(NodeTestTask.java:164)
        at org.junit.platform.engine.support.hierarchical.ThrowableCollector.execute(ThrowableCollector.java:74)
        at org.junit.platform.engine.support.hierarchical.NodeTestTask.executeRecursively(NodeTestTask.java:163)
        at org.junit.platform.engine.support.hierarchical.NodeTestTask.execute(NodeTestTask.java:116)
        at java.base/java.util.ArrayList.forEach(ArrayList.java:1596)
        at org.junit.platform.engine.support.hierarchical.SameThreadHierarchicalTestExecutorService.invokeAll(SameThreadHierarchicalTestExecutorService.java:42)
        at org.junit.platform.engine.support.hierarchical.NodeTestTask.lambda$executeRecursively$2(NodeTestTask.java:180)
        at org.junit.platform.engine.support.hierarchical.ThrowableCollector.execute(ThrowableCollector.java:74)
        at org.junit.platform.engine.support.hierarchical.NodeTestTask.lambda$executeRecursively$1(NodeTestTask.java:166)
        at org.junit.platform.engine.support.hierarchical.Node.around(Node.java:139)
        at org.junit.platform.engine.support.hierarchical.NodeTestTask.lambda$executeRecursively$0(NodeTestTask.java:164)
        at org.junit.platform.engine.support.hierarchical.ThrowableCollector.execute(ThrowableCollector.java:74)
        at org.junit.platform.engine.support.hierarchical.NodeTestTask.executeRecursively(NodeTestTask.java:163)
        at org.junit.platform.engine.support.hierarchical.NodeTestTask.execute(NodeTestTask.java:116)
        at org.junit.platform.engine.support.hierarchical.SameThreadHierarchicalTestExecutorService.submit(SameThreadHierarchicalTestExecutorService.java:36)
        at org.junit.platform.engine.support.hierarchical.HierarchicalTestExecutor.execute(HierarchicalTestExecutor.java:52)
        at org.junit.platform.engine.support.hierarchical.HierarchicalTestEngine.execute(HierarchicalTestEngine.java:58)
        at org.junit.platform.launcher.core.EngineExecutionOrchestrator.executeEngine(EngineExecutionOrchestrator.java:256)
        at org.junit.platform.launcher.core.EngineExecutionOrchestrator.failOrExecuteEngine(EngineExecutionOrchestrator.java:228)
        at org.junit.platform.launcher.core.EngineExecutionOrchestrator.execute(EngineExecutionOrchestrator.java:189)
        at org.junit.platform.launcher.core.EngineExecutionOrchestrator.execute(EngineExecutionOrchestrator.java:109)
        at org.junit.platform.launcher.core.EngineExecutionOrchestrator.lambda$execute$0(EngineExecutionOrchestrator.java:66)
        at org.junit.platform.launcher.core.EngineExecutionOrchestrator.withInterceptedStreams(EngineExecutionOrchestrator.java:168)
        at org.junit.platform.launcher.core.EngineExecutionOrchestrator.execute(EngineExecutionOrchestrator.java:65)
        at org.junit.platform.launcher.core.DefaultLauncher.execute(DefaultLauncher.java:137)
        at org.junit.platform.launcher.core.DefaultLauncher.execute(DefaultLauncher.java:126)
        at org.junit.platform.launcher.core.DelegatingLauncher.execute(DelegatingLauncher.java:71)
        at org.junit.platform.launcher.core.InterceptingLauncher.lambda$execute$2(InterceptingLauncher.java:66)
        at org.junit.platform.launcher.core.ClasspathAlignmentCheckingLauncherInterceptor.intercept(ClasspathAlignmentCheckingLauncherInterceptor.java:25)
        at org.junit.platform.launcher.core.InterceptingLauncher.execute(InterceptingLauncher.java:65)
        at org.junit.platform.launcher.core.DelegatingLauncher.execute(DelegatingLauncher.java:71)
        at java.base/jdk.internal.reflect.DirectMethodHandleAccessor.invoke(DirectMethodHandleAccessor.java:103)
        at java.base/java.lang.reflect.Method.invoke(Method.java:580)
        at org.apache.maven.surefire.api.util.ReflectionUtils.invokeMethodWithArray(ReflectionUtils.java:125)
        at org.apache.maven.surefire.junitplatform.LauncherAdapter.executeWithCancellationToken(LauncherAdapter.java:68)
        at org.apache.maven.surefire.junitplatform.LauncherAdapter.execute(LauncherAdapter.java:54)
        at org.apache.maven.surefire.junitplatform.JUnitPlatformProvider.execute(JUnitPlatformProvider.java:203)
        at org.apache.maven.surefire.junitplatform.JUnitPlatformProvider.invokeAllTests(JUnitPlatformProvider.java:168)
        at org.apache.maven.surefire.junitplatform.JUnitPlatformProvider.invoke(JUnitPlatformProvider.java:136)
        at org.apache.maven.surefire.booter.ForkedBooter.runSuitesInProcess(ForkedBooter.java:385)
        at org.apache.maven.surefire.booter.ForkedBooter.execute(ForkedBooter.java:162)
        at org.apache.maven.surefire.booter.ForkedBooter.run(ForkedBooter.java:507)
        at org.apache.maven.surefire.booter.ForkedBooter.main(ForkedBooter.java:495)

[INFO] Tests run: 3, Failures: 0, Errors: 0, Skipped: 0, Time elapsed: 1.771 s -- in com.jcabi.aspects.aj.QuietExceptionsLoggerTest
[INFO] Running com.jcabi.aspects.RetryOnFailureTest
[WARN] main com.jcabi.aspects.RetryOnFailureTest$2: #run(): attempt #1/3 failed with java.lang.AssertionError in 71µs (73µs in total): Should be caught and ignored.
[WARN] main com.jcabi.aspects.RetryOnFailureTest$1: #run(): attempt #1/3 failed with java.lang.IllegalArgumentException in 53µs (55µs in total): this exception should be caught and swallowed
[INFO] Tests run: 2, Failures: 0, Errors: 0, Skipped: 0, Time elapsed: 1.043 s -- in com.jcabi.aspects.RetryOnFailureTest
[INFO] Running com.jcabi.aspects.aj.ImmutabilityCheckerTest
[DEBUG] main com.jcabi.aspects.aj.ImmutabilityChecker: #check(class com.jcabi.aspects.aj.ImmutabilityCheckerTest$Recursive): immutability checked
[INFO] Tests run: 2, Failures: 0, Errors: 0, Skipped: 0, Time elapsed: 0.041 s -- in com.jcabi.aspects.aj.ImmutabilityCheckerTest
[INFO] Running com.jcabi.aspects.ScheduleWithFixedDelayTest
[INFO] main com.jcabi.aspects.ScheduleWithFixedDelayTest$Sample: scheduled for execution with 1 MILLISECONDS interval
[INFO] main com.jcabi.aspects.ScheduleWithFixedDelayTest$Sample: execution stopped after 1s and 910 tick(s)
[INFO] main com.jcabi.aspects.ScheduleWithFixedDelayTest$LongDelaySample: scheduled for execution with 1 MINUTES interval
[INFO] main com.jcabi.aspects.ScheduleWithFixedDelayTest$LongDelaySample: execution stopped after 104ms and 0 tick(s)
[INFO] main com.jcabi.aspects.ScheduleWithFixedDelayTest$Sample: scheduled for execution with 1 MILLISECONDS interval
[INFO] main com.jcabi.aspects.ScheduleWithFixedDelayTest$Sample: execution stopped after 1s and 921 tick(s)
[INFO] Tests run: 3, Failures: 0, Errors: 0, Skipped: 0, Time elapsed: 2.156 s -- in com.jcabi.aspects.ScheduleWithFixedDelayTest
[INFO] Running com.jcabi.aspects.CacheableTest
[INFO] main com.jcabi.aspects.aj.NamedThreads: jcabi-aspects 1.0-SNAPSHOT/40a237f started new daemon thread jcabi-cacheable-clean for automated cleaning of expired @Cacheable values
[INFO] main com.jcabi.aspects.aj.NamedThreads: jcabi-aspects 1.0-SNAPSHOT/40a237f started new daemon thread jcabi-cacheable-update for async update of expired @Cacheable values
[DEBUG] main com.jcabi.aspects.CacheableTest$Foo: #toString(): '8098176843037593148' in 17.65µs
[DEBUG] main com.jcabi.aspects.CacheableTest$Foo: #toString(): '8098176843037593148' cached in 0ms, valid forever
[DEBUG] main com.jcabi.aspects.CacheableTest$Foo: #get(): 8098176843037593148 in 49.76µs
[DEBUG] main com.jcabi.aspects.CacheableTest$Foo: #toString(): '8098176843037593148' from cache (hit #1, 1ms old)
[DEBUG] main com.jcabi.aspects.CacheableTest$Foo: #get(): 8098176843037593148 cached in 1ms, valid for 1s
[DEBUG] main com.jcabi.aspects.CacheableTest$Foo: #toString(): '8098176843037593148' from cache (hit #2, 1ms old)
[DEBUG] main com.jcabi.aspects.CacheableTest$Foo: #toString(): '8098176843037593148' from cache (hit #3, 1ms old)
[DEBUG] main com.jcabi.aspects.CacheableTest$Foo: #get(): 8098176843037593148 from cache (hit #1, 13ms old)
[DEBUG] main com.jcabi.aspects.CacheableTest$Foo: #toString(): '8098176843037593148' from cache (hit #4, 3ms old)
[DEBUG] main com.jcabi.aspects.CacheableTest$Foo: #toString(): '8098176843037593148' from cache (hit #5, 3ms old)
[DEBUG] main com.jcabi.aspects.CacheableTest$Foo: #flush(): #get():8098176843037593148 removed from cache before the call
[DEBUG] main com.jcabi.aspects.CacheableTest$Foo: #toString(): '-5954175948598423597' in 12.05µs
[DEBUG] main com.jcabi.aspects.CacheableTest$Foo: #toString(): '-5954175948598423597' cached in 1ms, valid forever
[DEBUG] main com.jcabi.aspects.CacheableTest$Foo: #get(): -5954175948598423597 in 72.57µs
[DEBUG] main com.jcabi.aspects.CacheableTest$Foo: #toString(): '-5954175948598423597' from cache (hit #1, 2ms old)
[DEBUG] main com.jcabi.aspects.CacheableTest$Foo: #get(): -5954175948598423597 cached in 2ms, valid for 1s
[DEBUG] main com.jcabi.aspects.CacheableTest$Foo: #toString(): '-5954175948598423597' from cache (hit #2, 2ms old)
[DEBUG] main com.jcabi.aspects.CacheableTest$Foo: #staticGet(): '4131924235906528414' cached in 0ms, valid for 1s
[DEBUG] main com.jcabi.aspects.CacheableTest$Foo: #staticGet(): '4131924235906528414' from cache (hit #1, 0ms old)
[DEBUG] main com.jcabi.aspects.CacheableTest$Foo: #staticFlush(): #staticGet():'4131924235906528414' removed from cache before the call
[DEBUG] main com.jcabi.aspects.CacheableTest$Foo: #staticGet(): '-7766367252487577818' cached in 0ms, valid for 1s
[DEBUG] pool-2-thread-1 com.jcabi.aspects.CacheableTest$Foo: #toString(): '-6365468817335596542' in 8.07µs
[DEBUG] pool-2-thread-1 com.jcabi.aspects.CacheableTest$Foo: #toString(): '-6365468817335596542' cached in 0ms, valid forever
[DEBUG] pool-2-thread-1 com.jcabi.aspects.CacheableTest$Foo: #get(): -6365468817335596542 in 60.81µs
[DEBUG] pool-2-thread-1 com.jcabi.aspects.CacheableTest$Foo: #toString(): '-6365468817335596542' from cache (hit #1, 0ms old)
[DEBUG] pool-2-thread-1 com.jcabi.aspects.CacheableTest$Foo: #get(): -6365468817335596542 cached in 2ms, valid for 1s
[DEBUG] pool-2-thread-1 com.jcabi.aspects.CacheableTest$Foo: #toString(): '-6365468817335596542' from cache (hit #2, 1ms old)
[DEBUG] pool-2-thread-2 com.jcabi.aspects.CacheableTest$Foo: #toString(): '-6365468817335596542' from cache (hit #3, 1ms old)
[DEBUG] pool-2-thread-2 com.jcabi.aspects.CacheableTest$Foo: #get(): -6365468817335596542 from cache (hit #1, 2ms old)
[DEBUG] pool-2-thread-2 com.jcabi.aspects.CacheableTest$Foo: #toString(): '-6365468817335596542' from cache (hit #4, 2ms old)
[DEBUG] Thread-32 com.jcabi.aspects.CacheableTest$Foo: #never(): thrown java.lang.IllegalStateException(java.lang.InterruptedException: sleep interrupted) out of com.jcabi.aspects.CacheableTest$Foo#never_aroundBody12[209] in 7ms
Exception in thread "Thread-32" java.lang.IllegalStateException: java.lang.InterruptedException: sleep interrupted
        at com.jcabi.aspects.CacheableTest$Foo.never_aroundBody12(CacheableTest.java:209)
        at com.jcabi.aspects.CacheableTest$Foo$AjcClosure13.run(CacheableTest.java:1)
        at org.aspectj.runtime.reflect.JoinPointImpl.proceed(JoinPointImpl.java:167)
        at com.jcabi.aspects.aj.MethodLogger.wrap(MethodLogger.java:178)
        at com.jcabi.aspects.aj.MethodLogger.ajc$inlineAccessMethod$com_jcabi_aspects_aj_MethodLogger$com_jcabi_aspects_aj_MethodLogger$wrap(MethodLogger.java:1)
        at com.jcabi.aspects.aj.MethodLogger.wrapMethod(MethodLogger.java:137)
        at com.jcabi.aspects.CacheableTest$Foo.never_aroundBody14(CacheableTest.java:205)
        at com.jcabi.aspects.CacheableTest$Foo$AjcClosure15.run(CacheableTest.java:1)
        at org.aspectj.runtime.reflect.JoinPointImpl.proceed(JoinPointImpl.java:167)
        at com.jcabi.aspects.aj.Tunnel.through(Tunnel.java:91)
        at com.jcabi.aspects.aj.MethodCacher.cache(MethodCacher.java:152)
        at com.jcabi.aspects.CacheableTest$Foo.never(CacheableTest.java:205)
        at java.base/java.lang.Thread.run(Thread.java:1583)
Caused by: java.lang.InterruptedException: sleep interrupted
        at java.base/java.lang.Thread.sleep0(Native Method)
        at java.base/java.lang.Thread.sleep(Thread.java:558)
        at java.base/java.util.concurrent.TimeUnit.sleep(TimeUnit.java:446)
        at com.jcabi.aspects.CacheableTest$Foo.never_aroundBody12(CacheableTest.java:207)
        ... 12 more
[DEBUG] main com.jcabi.aspects.CacheableTest$Foo: #toString(): '4417914232533378109' in 8.09µs
[DEBUG] main com.jcabi.aspects.CacheableTest$Foo: #toString(): '4417914232533378109' cached in 1ms, valid forever
[DEBUG] main com.jcabi.aspects.CacheableTest$Foo: #get(): 4417914232533378109 in 20.54µs
[DEBUG] main com.jcabi.aspects.CacheableTest$Foo: #toString(): '4417914232533378109' from cache (hit #1, 2ms old)
[DEBUG] main com.jcabi.aspects.CacheableTest$Foo: #get(): 4417914232533378109 cached in 13ms, valid for 1s
[DEBUG] main com.jcabi.aspects.CacheableTest$Foo: #toString(): '4417914232533378109' from cache (hit #2, 13ms old)
[DEBUG] jcabi-cacheable-clean com.jcabi.aspects.aj.MethodCacher: #staticGet():'-7766367252487577818' expired in cache
[DEBUG] jcabi-cacheable-clean com.jcabi.aspects.CacheableTest$Foo: #toString(): '-5954175948598423597' from cache (hit #3, 2s old)
[DEBUG] jcabi-cacheable-clean com.jcabi.aspects.aj.MethodCacher: #get():-5954175948598423597 expired in cache
[DEBUG] jcabi-cacheable-clean com.jcabi.aspects.CacheableTest$Foo: #toString(): '-6365468817335596542' from cache (hit #5, 2s old)
[DEBUG] jcabi-cacheable-clean com.jcabi.aspects.aj.MethodCacher: #get():-6365468817335596542 expired in cache
[DEBUG] jcabi-cacheable-clean com.jcabi.aspects.CacheableTest$Foo: #toString(): '4417914232533378109' from cache (hit #3, 2s old)
[DEBUG] jcabi-cacheable-clean com.jcabi.aspects.aj.MethodCacher: #get():4417914232533378109 expired in cache
[DEBUG] main com.jcabi.aspects.CacheableTest$Foo: #toString(): '-8831956383667719832' in 14.75µs
[DEBUG] main com.jcabi.aspects.CacheableTest$Foo: #toString(): '-8831956383667719832' cached in 0ms, valid forever
[DEBUG] main com.jcabi.aspects.CacheableTest$Foo: #get(): -8831956383667719832 in 127.49µs
[DEBUG] main com.jcabi.aspects.CacheableTest$Foo: #toString(): '-8831956383667719832' from cache (hit #1, 1ms old)
[DEBUG] main com.jcabi.aspects.CacheableTest$Foo: #get(): -8831956383667719832 cached in 2ms, valid for 1s
[DEBUG] main com.jcabi.aspects.CacheableTest$Foo: #toString(): '-8831956383667719832' from cache (hit #2, 1ms old)
[DEBUG] main com.jcabi.aspects.CacheableTest$Bar: #get(): -289657032640039238 cached in 0ms, valid for 1min
[DEBUG] main com.jcabi.aspects.CacheableTest$Bar: #get(): #get():-289657032640039238 removed from cache before the call
[DEBUG] main com.jcabi.aspects.CacheableTest$Bar: #get(): 2774771583994434508 cached in 0ms, valid for 1min
[WARNING] Tests run: 6, Failures: 0, Errors: 0, Skipped: 1, Time elapsed: 5.135 s -- in com.jcabi.aspects.CacheableTest
[INFO] Running com.jcabi.aspects.UnitedThrowTest
[DEBUG] main com.jcabi.aspects.aj.ImmutabilityChecker: #check(class com.jcabi.aspects.aj.SingleException): immutability checked
[INFO] Tests run: 5, Failures: 0, Errors: 0, Skipped: 0, Time elapsed: 0.053 s -- in com.jcabi.aspects.UnitedThrowTest
[INFO] Running com.jcabi.aspects.ImmutableTest
[DEBUG] main com.jcabi.aspects.aj.ImmutabilityChecker: #check(class com.jcabi.aspects.ImmutableTest$TrulyImmutableWithNonPrivateFields): immutability checked
[DEBUG] main com.jcabi.aspects.aj.ImmutabilityChecker: #check(class com.jcabi.aspects.ImmutableTest$TrulyImmutable): immutability checked
[INFO] Tests run: 6, Failures: 0, Errors: 0, Skipped: 0, Time elapsed: 0.047 s -- in com.jcabi.aspects.ImmutableTest
[INFO]
[INFO] Results:
[INFO]
[INFO] Tests run: 71, Failures: 0, Errors: 0, Skipped: 3
[INFO]
[INFO]
[INFO] --- jcabi:0.17.0:versionalize (jcabi-versionalize-packages) @ jcabi-aspects ---
[INFO] Versionalizing /home/r/repo/target/classes directory
[INFO] File /home/r/repo/target/classes/com/jcabi/aspects/aj/com-jcabi-jcabi-aspects-bundle.txt added
[INFO] File /home/r/repo/target/classes/com/jcabi/aspects/apt/com-jcabi-jcabi-aspects-bundle.txt added
[INFO] File /home/r/repo/target/classes/com/jcabi/aspects/com-jcabi-jcabi-aspects-bundle.txt added
[INFO]
[INFO] --- bundle:5.1.9:bundle (default-bundle) @ jcabi-aspects ---
[INFO] Building bundle: /home/r/repo/target/jcabi-aspects-1.0-SNAPSHOT.jar
[INFO] Writing manifest: /home/r/repo/target/classes/META-INF/MANIFEST.MF
[INFO]
[INFO] --- assembly:3.8.0:single (assemble-all) @ jcabi-aspects ---
[INFO] Building jar: /home/r/repo/target/jcabi-aspects-1.0-SNAPSHOT-jar-with-dependencies.jar
[INFO]
[INFO] --- invoker:3.10.1:install (default) @ jcabi-aspects ---
[INFO] Installing /home/r/repo/target/jcabi-aspects-1.0-SNAPSHOT.jar to /home/r/repo/target/local-repo/com/jcabi/jcabi-aspects/1.0-SNAPSHOT/jcabi-aspects-1.0-SNAPSHOT.jar
[INFO] Installing /home/r/repo/target/jcabi-aspects-1.0-SNAPSHOT-jar-with-dependencies.jar to /home/r/repo/target/local-repo/com/jcabi/jcabi-aspects/1.0-SNAPSHOT/jcabi-aspects-1.0-SNAPSHOT-jar-with-dependencies.jar
[INFO] Installing /home/r/repo/pom.xml to /home/r/repo/target/local-repo/com/jcabi/jcabi-aspects/1.0-SNAPSHOT/jcabi-aspects-1.0-SNAPSHOT.pom
[INFO] Installing /home/r/.m2/repository/com/jcabi/jcabi/1.45.0/jcabi-1.45.0.pom to /home/r/repo/target/local-repo/com/jcabi/jcabi/1.45.0/jcabi-1.45.0.pom
[INFO] Installing /home/r/.m2/repository/com/jcabi/parent/0.73.3/parent-0.73.3.pom to /home/r/repo/target/local-repo/com/jcabi/parent/0.73.3/parent-0.73.3.pom
[INFO] Installing /home/r/.m2/repository/com/jcabi/jcabi-log/0.24.3/jcabi-log-0.24.3.jar to /home/r/repo/target/local-repo/com/jcabi/jcabi-log/0.24.3/jcabi-log-0.24.3.jar
[INFO] Installing /home/r/.m2/repository/com/jcabi/jcabi-log/0.24.3/jcabi-log-0.24.3.pom to /home/r/repo/target/local-repo/com/jcabi/jcabi-log/0.24.3/jcabi-log-0.24.3.pom
[INFO] Installing /home/r/.m2/repository/org/slf4j/slf4j-api/2.0.16/slf4j-api-2.0.16.jar to /home/r/repo/target/local-repo/org/slf4j/slf4j-api/2.0.16/slf4j-api-2.0.16.jar
[INFO] Installing /home/r/.m2/repository/org/slf4j/slf4j-api/2.0.16/slf4j-api-2.0.16.pom to /home/r/repo/target/local-repo/org/slf4j/slf4j-api/2.0.16/slf4j-api-2.0.16.pom
[INFO] Installing /home/r/.m2/repository/org/aspectj/aspectjrt/1.9.25.1/aspectjrt-1.9.25.1.jar to /home/r/repo/target/local-repo/org/aspectj/aspectjrt/1.9.25.1/aspectjrt-1.9.25.1.jar
[INFO] Installing /home/r/.m2/repository/org/aspectj/aspectjrt/1.9.25.1/aspectjrt-1.9.25.1.pom to /home/r/repo/target/local-repo/org/aspectj/aspectjrt/1.9.25.1/aspectjrt-1.9.25.1.pom
[INFO] Installing /home/r/.m2/repository/javax/validation/validation-api/2.0.1.Final/validation-api-2.0.1.Final.jar to /home/r/repo/target/local-repo/javax/validation/validation-api/2.0.1.Final/validation-api-2.0.1.Final.jar
[INFO] Installing /home/r/.m2/repository/javax/validation/validation-api/2.0.1.Final/validation-api-2.0.1.Final.pom to /home/r/repo/target/local-repo/javax/validation/validation-api/2.0.1.Final/validation-api-2.0.1.Final.pom
[INFO] Installing /home/r/.m2/repository/com/jcabi/parent/0.64.1/parent-0.64.1.pom to /home/r/repo/target/local-repo/com/jcabi/parent/0.64.1/parent-0.64.1.pom
[INFO] Installing /home/r/.m2/repository/com/jcabi/jcabi/1.37.1/jcabi-1.37.1.pom to /home/r/repo/target/local-repo/com/jcabi/jcabi/1.37.1/jcabi-1.37.1.pom
[INFO] Installing /home/r/.m2/repository/org/slf4j/slf4j-bom/2.0.16/slf4j-bom-2.0.16.pom to /home/r/repo/target/local-repo/org/slf4j/slf4j-bom/2.0.16/slf4j-bom-2.0.16.pom
[INFO] Installing /home/r/.m2/repository/org/slf4j/slf4j-parent/2.0.16/slf4j-parent-2.0.16.pom to /home/r/repo/target/local-repo/org/slf4j/slf4j-parent/2.0.16/slf4j-parent-2.0.16.pom
[INFO]
[INFO] --- invoker:3.10.1:run (default) @ jcabi-aspects ---
[INFO] Building: processor/pom.xml
[INFO]           processor/pom.xml ................................ SUCCESS (15.33 s)
[INFO] Building: weaving/pom.xml
[INFO]           weaving/pom.xml .................................. SUCCESS (24.36 s)
[INFO] Building: loggable/pom.xml
[INFO]           loggable/pom.xml ................................. SUCCESS (25.66 s)
[INFO] Building: fake-validation/pom.xml
[INFO]           fake-validation/pom.xml .......................... SUCCESS (14.62 s)
[INFO] -------------------------------------------------
[INFO] Build Summary:
[INFO]   Passed: 4, Failed: 0, Errors: 0, Skipped: 0
[INFO] -------------------------------------------------
[INFO]
[INFO] --- qulice:0.36.0:check (jcabi-qulice-check) @ jcabi-aspects ---
[INFO] Calling org.apache.maven.plugins:maven-enforcer-plugin:3.1.0:enforce...
[INFO] Calling org.basepom.maven:duplicate-finder-maven-plugin:2.0.1:check...
[INFO] Checking compile classpath
[INFO] Checking runtime classpath
[INFO] No dependency problems found
[INFO] Qulice checked 72 .java files against 1020 rules (243 Checkstyle, 284 PMD, 493 ErrorProne) in 39s
[INFO]
[INFO] --- install:3.1.4:install (default-install) @ jcabi-aspects ---
[INFO] Installing /home/r/repo/pom.xml to /home/r/.m2/repository/com/jcabi/jcabi-aspects/1.0-SNAPSHOT/jcabi-aspects-1.0-SNAPSHOT.pom
[INFO] Installing /home/r/repo/target/jcabi-aspects-1.0-SNAPSHOT.jar to /home/r/.m2/repository/com/jcabi/jcabi-aspects/1.0-SNAPSHOT/jcabi-aspects-1.0-SNAPSHOT.jar
[INFO] Installing /home/r/repo/target/jcabi-aspects-1.0-SNAPSHOT-jar-with-dependencies.jar to /home/r/.m2/repository/com/jcabi/jcabi-aspects/1.0-SNAPSHOT/jcabi-aspects-1.0-SNAPSHOT-jar-with-dependencies.jar
[INFO]
[INFO] --- bundle:5.1.9:install (default-install) @ jcabi-aspects ---
[INFO] Writing OBR metadata
[INFO] Installing com/jcabi/jcabi-aspects/1.0-SNAPSHOT/jcabi-aspects-1.0-SNAPSHOT.jar
[INFO] Installing com/jcabi/jcabi-aspects/1.0-SNAPSHOT/jcabi-aspects-1.0-SNAPSHOT-jar-with-dependencies.jar
[INFO] Writing OBR metadata
[INFO] ------------------------------------------------------------------------
[INFO] BUILD SUCCESS
[INFO] ------------------------------------------------------------------------
[INFO] Total time:  03:27 min
[INFO] Finished at: 2026-09-15T03:06:10Z
[INFO] ------------------------------------------------------------------------
0m0m+ mv /home/r/repo .
++ whoami
+ chown -R root repo
+ '[' -n '' ']'
++ whoami
+ sudo chown -R ubuntu repo
+ cd repo
+ git push origin master
remote:
remote: GitHub found 16 vulnerabilities on jcabi/jcabi-aspects's default branch (6 critical, 6 high, 4 moderate). To find out more, visit:
remote:      https://github.com/jcabi/jcabi-aspects/security/dependabot
remote:
To github.com:jcabi/jcabi-aspects.git
   882b04c2..40a237fd  master -> master
container 78e59794e54b88e757df02ccc8492d2a06c0f6467f1c9a780381ef575c4c3ff8 is dead
Tue Sep 15 03:11:51 UTC 2026