rultor.com logo This build log was produced by rultor.com for jcabi/jcabi-log#279
++ dirname ./run.sh
+ cd .
+ echo 1695
+ echo '2.0-SNAPSHOT BUILD'
2.0-SNAPSHOT BUILD
+ date
Sat Sep 26 03:37:45 UTC 2026
+ uptime
 03:37:45 up 18 min,  0 users,  load average: 0.14, 0.03, 0.01
+ ff=default
+ image=yegor256/java
+ rebase=false
+ head_branch=master
+ pull_title='Update slf4j monorepo to v2.0.20'
+ author=yegor256
+ directory=
+ head=git@github.com:jcabi/jcabi-log.git
+ pull_id=279
+ fork=git@github.com:jcabi/jcabi-log.git
+ fork_branch=renovate/slf4j-monorepo
+ squash=false
+ vars=('--env=head=git@github.com:jcabi/jcabi-log.git' '--env=pull_id=279' '--env=fork=git@github.com:jcabi/jcabi-log.git' '--env=fork_branch=renovate/slf4j-monorepo' '--env=head_branch=master' '--env=pull_title=Update slf4j monorepo to v2.0.20' '--env=author=yegor256' '--env=scripts=( '\''export '\''\'\'''\''head=git@github.com:jcabi/jcabi-log.git'\''\'\'''\'''\'' '\'';'\'' '\''export '\''\'\'''\''pull_id=279'\''\'\'''\'''\'' '\'';'\'' '\''export '\''\'\'''\''fork=git@github.com:jcabi/jcabi-log.git'\''\'\'''\'''\'' '\'';'\'' '\''export '\''\'\'''\''fork_branch=renovate/slf4j-monorepo'\''\'\'''\'''\'' '\'';'\'' '\''export '\''\'\'''\''head_branch=master'\''\'\'''\'''\'' '\'';'\'' '\''export '\''\'\'''\''pull_title=Update slf4j monorepo to v2.0.20'\''\'\'''\'''\'' '\'';'\'' '\''export '\''\'\'''\''author=yegor256'\''\'\'''\'''\'' '\'';'\'' '\''pdd --file=/dev/null'\'' '\'';'\'' '\''mvn clean install -ntp -Pqulice --errors --batch-mode'\'' '\'';'\'' )')
+ scripts=('export '\''head=git@github.com:jcabi/jcabi-log.git'\''' ';' 'export '\''pull_id=279'\''' ';' 'export '\''fork=git@github.com:jcabi/jcabi-log.git'\''' ';' 'export '\''fork_branch=renovate/slf4j-monorepo'\''' ';' 'export '\''head_branch=master'\''' ';' 'export '\''pull_title=Update slf4j monorepo to v2.0.20'\''' ';' 'export '\''author=yegor256'\''' ';' 'pdd --file=/dev/null' ';' 'mvn clean install -ntp -Pqulice --errors --batch-mode' ';')
+ container=jcabi_jcabi-log_279
+ as_root=false
+ set -e -o pipefail
+ hostname
ip-172-31-27-207
+ pwd
/tmp/rultor-qB1B
+ git --version
git version 2.34.1
+ docker --version
Docker version 25.0.3, build 4debf41
+ mkdir -p /home/ubuntu/.ssh
+ echo -e 'Host github.com\n\tStrictHostKeyChecking no\n'
+ chmod 600 /home/ubuntu/.ssh/config
+ git clone --recurse-submodules git@github.com:jcabi/jcabi-log.git repo
Cloning into 'repo'...
Warning: Permanently added 'github.com' (ED25519) to the list of known hosts.
+ cd repo
+ git config user.email gpg@rultor.com
+ git config user.name Rultor.com
+ '[' -z 'export '\''head=git@github.com:jcabi/jcabi-log.git'\''' ']'
+ cd ..
+ cat
+ '[' false = true ']'
+ cat
+ chmod a+x entry.sh
+ cat
+ echo 'export '\''head=git@github.com:jcabi/jcabi-log.git'\''' ';' 'export '\''pull_id=279'\''' ';' 'export '\''fork=git@github.com:jcabi/jcabi-log.git'\''' ';' 'export '\''fork_branch=renovate/slf4j-monorepo'\''' ';' 'export '\''head_branch=master'\''' ';' 'export '\''pull_title=Update slf4j monorepo to v2.0.20'\''' ';' 'export '\''author=yegor256'\''' ';' 'pdd --file=/dev/null' ';' 'mvn clean install -ntp -Pqulice --errors --batch-mode' ';'
+ sensitive=()
+ set -ex -o pipefail
+ cd repo
+ git remote add fork git@github.com:jcabi/jcabi-log.git
+ git remote update
Fetching origin
Fetching fork
From github.com:jcabi/jcabi-log
 * [new branch]      dependabot/maven/com.jcabi-jcabi-1.27.0 -> fork/dependabot/maven/com.jcabi-jcabi-1.27.0
 * [new branch]      dependabot/maven/org.junit.jupiter-junit-jupiter-params-5.7.0 -> fork/dependabot/maven/org.junit.jupiter-junit-jupiter-params-5.7.0
 * [new branch]      dependabot/maven/org.slf4j-slf4j-api-2.0.0-alpha1 -> fork/dependabot/maven/org.slf4j-slf4j-api-2.0.0-alpha1
 * [new branch]      gh-pages                -> fork/gh-pages
 * [new branch]      master                  -> fork/master
 * [new branch]      renovate/crate-ci-typos-1.x -> fork/renovate/crate-ci-typos-1.x
 * [new branch]      renovate/slf4j-monorepo -> fork/renovate/slf4j-monorepo
+ args=()
+ '[' default == default ']'
+ args+=(--ff)
+ '[' default == no ']'
+ '[' default == only ']'
+ '[' false == true ']'
+ BRANCH=__rultor
++ wc -l
++ git show-branch __rultor
+ '[' 0 -gt 0 ']'
+ export BRANCH
+ git status
On branch master
Your branch is up to date with 'origin/master'.

nothing to commit, working tree clean
+ git checkout -B __rultor fork/renovate/slf4j-monorepo
Switched to a new branch '__rultor'
Branch '__rultor' set up to track remote branch 'renovate/slf4j-monorepo' from 'fork'.
+ git checkout -B master origin/master
Switched to and reset branch 'master'
Branch 'master' set up to track remote branch 'master' from 'origin'.
Your branch is up to date with 'origin/master'.
+ '[' false == true ']'
+ KEY=3FD3FA7E9AF0FA4C
+ git merge --gpg-sign=3FD3FA7E9AF0FA4C --no-edit -m 'Update slf4j monorepo to v2.0.20' --ff __rultor
Updating 201dc4e..003f938
Fast-forward (no commit created; -m option ignored)
 pom.xml | 4 ++--
 1 file changed, 2 insertions(+), 2 deletions(-)
+ git log -1 --show-signature
commit 003f938a004af248f17394ee53a055a5f7aa83bb
gpg: Signature made Thu Sep 24 09:04:02 2026 UTC
gpg:                using RSA key B5690EEEBB952194
gpg: Can't check signature: No public key
Author: renovate[bot] <29139614+renovate[bot]@users.noreply.github.com>
Date:   Thu Sep 24 09:04:02 2026 +0000

    Update slf4j monorepo to v2.0.20
+ docker_when_possible
+ true
++ tail -n 1
++ sed 's/ /\n/g'
++ uptime
+ load=0.02
++ bc
++ echo 0.02 '>' 30
+ '[' 0 -eq 1 ']'
+ echo 'load average is 0.02, low enough to run a new Docker container'
load average is 0.02, low enough to run a new Docker container
+ break
+ cd ..
+ '[' -n '' ']'
+ use_image=yegor256/java
+ docker pull yegor256/java
Using default tag: latest
latest: Pulling from yegor256/java
cb259a83ac3d: Pulling fs layer
4f4fb700ef54: Pulling fs layer
50778be6ae7c: Pulling fs layer
de39015cb2a0: Pulling fs layer
c5d1f12c356a: Pulling fs layer
e9b75b04736a: Pulling fs layer
74aacb7acb4e: Pulling fs layer
b343964c14ed: Pulling fs layer
2da5d65999c3: Pulling fs layer
f8ae7b3bd9d2: Pulling fs layer
62bf76adc5c1: Pulling fs layer
6f3edb78ee5d: Pulling fs layer
de39015cb2a0: Waiting
c5d1f12c356a: Waiting
e9b75b04736a: Waiting
74aacb7acb4e: Waiting
b343964c14ed: Waiting
2da5d65999c3: Waiting
f8ae7b3bd9d2: Waiting
62bf76adc5c1: Waiting
6f3edb78ee5d: Waiting
4f4fb700ef54: Verifying Checksum
4f4fb700ef54: Download complete
50778be6ae7c: Verifying Checksum
50778be6ae7c: Download complete
cb259a83ac3d: Verifying Checksum
cb259a83ac3d: Download complete
e9b75b04736a: Verifying Checksum
e9b75b04736a: Download complete
74aacb7acb4e: Verifying Checksum
74aacb7acb4e: Download complete
b343964c14ed: Verifying Checksum
b343964c14ed: Download complete
2da5d65999c3: Verifying Checksum
2da5d65999c3: Download complete
c5d1f12c356a: Verifying Checksum
c5d1f12c356a: Download complete
de39015cb2a0: Verifying Checksum
de39015cb2a0: Download complete
62bf76adc5c1: Verifying Checksum
62bf76adc5c1: Download complete
f8ae7b3bd9d2: Verifying Checksum
f8ae7b3bd9d2: Download complete
cb259a83ac3d: Pull complete
4f4fb700ef54: Pull complete
50778be6ae7c: Pull complete
6f3edb78ee5d: Verifying Checksum
6f3edb78ee5d: Download complete
de39015cb2a0: Pull complete
c5d1f12c356a: Pull complete
e9b75b04736a: Pull complete
74aacb7acb4e: Pull complete
b343964c14ed: Pull complete
2da5d65999c3: Pull complete
f8ae7b3bd9d2: Pull complete
62bf76adc5c1: Pull complete
6f3edb78ee5d: Pull complete
Digest: sha256:321ee930e2e2723cfabc943101c63a26019e88bb50a6a98690958ec3649391bc
Status: Downloaded newer image for yegor256/java:latest
docker.io/yegor256/java:latest
+ docker ps --filter=status=exited
+ grep --quiet '\sjcabi_jcabi-log_279\s*$'
+ ls -al .
total 60
drwx------  3 ubuntu ubuntu 4096 Sep 26 03:37 .
drwxrwxrwt 12 root   root   4096 Sep 26 03:37 ..
-rwxrwxr-x  1 ubuntu ubuntu  666 Sep 26 03:37 end.sh
-rwxrwxr-x  1 ubuntu ubuntu  498 Sep 26 03:37 entry.sh
-rw-rw-r--  1 ubuntu ubuntu    5 Sep 26 03:37 pid
-rw-rw-r--  1 ubuntu ubuntu 1192 Sep 26 03:37 pubring.gpg
drwxrwxr-x  6 ubuntu ubuntu 4096 Sep 26 03:37 repo
-rwxrwxr-x  1 ubuntu ubuntu 6455 Sep 26 03:37 run.sh
-rw-rw-r--  1 ubuntu ubuntu  550 Sep 26 03:37 script.sh
-rw-rw-r--  1 ubuntu ubuntu 2570 Sep 26 03:37 secring.gpg
-rw-rw-r--  1 ubuntu ubuntu 4430 Sep 26 03:37 settings.xml
-rw-rw-r--  1 ubuntu ubuntu 7679 Sep 26 03:38 stdout
++ pwd
++ pwd
+ docker run -t --rm -v /tmp/rultor-qB1B:/main --env=head=git@github.com:jcabi/jcabi-log.git --env=pull_id=279 --env=fork=git@github.com:jcabi/jcabi-log.git --env=fork_branch=renovate/slf4j-monorepo --env=head_branch=master '--env=pull_title=Update slf4j monorepo to v2.0.20' --env=author=yegor256 '--env=scripts=( '\''export '\''\'\'''\''head=git@github.com:jcabi/jcabi-log.git'\''\'\'''\'''\'' '\'';'\'' '\''export '\''\'\'''\''pull_id=279'\''\'\'''\'''\'' '\'';'\'' '\''export '\''\'\'''\''fork=git@github.com:jcabi/jcabi-log.git'\''\'\'''\'''\'' '\'';'\'' '\''export '\''\'\'''\''fork_branch=renovate/slf4j-monorepo'\''\'\'''\'''\'' '\'';'\'' '\''export '\''\'\'''\''head_branch=master'\''\'\'''\'''\'' '\'';'\'' '\''export '\''\'\'''\''pull_title=Update slf4j monorepo to v2.0.20'\''\'\'''\'''\'' '\'';'\'' '\''export '\''\'\'''\''author=yegor256'\''\'\'''\'''\'' '\'';'\'' '\''pdd --file=/dev/null'\'' '\'';'\'' '\''mvn clean install -ntp -Pqulice --errors --batch-mode'\'' '\'';'\'' )' --hostname=docker --privileged --net=host --dns 8.8.8.8 --add-host docker:127.0.0.1 --memory=8g --memory-swap=16g --oom-kill-disable --cidfile=/tmp/rultor-qB1B/cid -w=/main -v /var/run/docker.sock:/var/run/docker.sock --name=jcabi_jcabi-log_279 yegor256/java /main/entry.sh
WARNING: Your kernel does not support OomKillDisable. OomKillDisable discarded.
+ set -e
+ set -o pipefail
+ shopt -s dotglob
+ useradd -m -G sudo r
++ awk -F : '$3 > 100 { print $1 }'
++ cat /etc/group
+ for g in $(cat /etc/group | awk -F ':' '$3 > 100 { print $1 }')
+ usermod -a -G nogroup r
+ for g in $(cat /etc/group | awk -F ':' '$3 > 100 { print $1 }')
+ usermod -a -G ubuntu r
+ for g in $(cat /etc/group | awk -F ':' '$3 > 100 { print $1 }')
+ usermod -a -G systemd-journal r
+ for g in $(cat /etc/group | awk -F ':' '$3 > 100 { print $1 }')
+ usermod -a -G systemd-network r
+ for g in $(cat /etc/group | awk -F ':' '$3 > 100 { print $1 }')
+ usermod -a -G messagebus r
+ for g in $(cat /etc/group | awk -F ':' '$3 > 100 { print $1 }')
+ usermod -a -G _ssh r
+ for g in $(cat /etc/group | awk -F ':' '$3 > 100 { print $1 }')
+ usermod -a -G polkitd r
+ for g in $(cat /etc/group | awk -F ':' '$3 > 100 { print $1 }')
+ usermod -a -G ssh r
+ for g in $(cat /etc/group | awk -F ':' '$3 > 100 { print $1 }')
+ usermod -a -G docker r
+ for g in $(cat /etc/group | awk -F ':' '$3 > 100 { print $1 }')
+ usermod -a -G r r
+ usermod -s /bin/bash r
+ echo '%sudo ALL=(ALL) NOPASSWD:ALL'
+ cp -R /root/.bashrc /root/.cache /root/.gemrc /root/.gradle /root/.m2 /root/.profile /root/.ssh /root/.wget-hsts /home/r
+ cp -R ./cid ./end.sh ./entry.sh ./pid ./pubring.gpg ./repo ./run.sh ./script.sh ./secring.gpg ./settings.xml ./stdout /home/r
+ rm -rf repo
+ chown -R r:r /home/r
+ chmod a+x /home/r/script.sh
+ cat /home/r/script.sh
#!/usr/bin/env bash
set -e
set -o pipefail
if [ -e /home/r/.profile ]; then source /home/r/.profile; fi
shopt -s expand_aliases
alias 'sudo=sudo -i'
export HOME=/home/r
cd "${HOME}/repo"
export 'head=git@github.com:jcabi/jcabi-log.git' ; export 'pull_id=279' ; export 'fork=git@github.com:jcabi/jcabi-log.git' ; export 'fork_branch=renovate/slf4j-monorepo' ; export 'head_branch=master' ; export 'pull_title=Update slf4j monorepo to v2.0.20' ; export 'author=yegor256' ; pdd --file=/dev/null ; mvn clean install -ntp -Pqulice --errors --batch-mode ;
+ su --login r --command /home/r/script.sh
Found 7 lines in /home/r/repo/.pdd
My version is 0.23.1
Ruby version is 3.4.9 at x86_64-linux
Reading from root dir .
Excluding target/**/*
Excluding src/main/resources/images/**/*
/usr/local/bundle/gems/pdd-0.23.1/lib/pdd/sources.rb:90: warning: undefining the allocator of T_DATA class FileMagic
/home/r/repo/renovate.json is a binary file (107 bytes)
Reading .0pdd.yml ...
Reading .gitattributes ...
Reading .github/workflows/actionlint.yml ...
Reading .github/workflows/codecov.yml ...
Reading .github/workflows/copyrights.yml ...
Reading .github/workflows/markdown-lint.yml ...
Reading .github/workflows/mvn.yml ...
Reading .github/workflows/pdd.yml ...
Reading .github/workflows/reuse.yml ...
Reading .github/workflows/typos.yml ...
Reading .github/workflows/xcop.yml ...
Reading .github/workflows/yamllint.yml ...
Reading .gitignore ...
Reading .pdd ...
Reading .rultor.yml ...
Reading LICENSE.txt ...
Reading LICENSES/MIT.txt ...
Reading README.md ...
Reading REUSE.toml ...
Reading pom.xml ...
Reading src/it/it-decoloring/invoker.properties ...
Reading src/it/it-decoloring/pom.xml ...
Reading src/it/it-decoloring/src/main/java/com/jcabi/log/MulticolorLayoutIntegration.java ...
Reading src/it/it-decoloring/src/main/java/com/jcabi/log/package-info.java ...
Reading src/it/it-decoloring/src/test/java/com/jcabi/log/MulticolorLayoutIntegrationTest.java ...
Reading src/it/it-decoloring/src/test/java/com/jcabi/log/package-info.java ...
Reading src/it/settings.xml ...
Reading src/main/java/com/jcabi/log/ArrayFormatAction.java ...
Reading src/main/java/com/jcabi/log/ColorfullyFormatted.java ...
Reading src/main/java/com/jcabi/log/Colors.java ...
Reading src/main/java/com/jcabi/log/ControlSequenceIndicatorFormatted.java ...
Reading src/main/java/com/jcabi/log/ConversionPattern.java ...
Reading src/main/java/com/jcabi/log/DecorException.java ...
Reading src/main/java/com/jcabi/log/DecorsManager.java ...
Reading src/main/java/com/jcabi/log/DomDecor.java ...
Reading src/main/java/com/jcabi/log/DullyFormatted.java ...
Reading src/main/java/com/jcabi/log/ExceptionDecor.java ...
Reading src/main/java/com/jcabi/log/FileDecor.java ...
Reading src/main/java/com/jcabi/log/Formatted.java ...
Reading src/main/java/com/jcabi/log/ListDecor.java ...
Reading src/main/java/com/jcabi/log/Logger.java ...
Reading src/main/java/com/jcabi/log/Monitor.java ...
Reading src/main/java/com/jcabi/log/MsDecor.java ...
Reading src/main/java/com/jcabi/log/MulticolorLayout.java ...
Reading src/main/java/com/jcabi/log/NanoDecor.java ...
Reading src/main/java/com/jcabi/log/ObjectContentsFormatAction.java ...
Reading src/main/java/com/jcabi/log/ObjectDecor.java ...
Reading src/main/java/com/jcabi/log/ParseableInformation.java ...
Reading src/main/java/com/jcabi/log/ParseableLevelInformation.java ...
Reading src/main/java/com/jcabi/log/PreFormatter.java ...
Reading src/main/java/com/jcabi/log/Result.java ...
Reading src/main/java/com/jcabi/log/SecretDecor.java ...
Reading src/main/java/com/jcabi/log/SizeDecor.java ...
Reading src/main/java/com/jcabi/log/Supplier.java ...
Reading src/main/java/com/jcabi/log/SupplierLogger.java ...
Reading src/main/java/com/jcabi/log/TextDecor.java ...
Reading src/main/java/com/jcabi/log/TypeDecor.java ...
Reading src/main/java/com/jcabi/log/VerboseCallable.java ...
Reading src/main/java/com/jcabi/log/VerboseProcess.java ...
Reading src/main/java/com/jcabi/log/VerboseRunnable.java ...
Reading src/main/java/com/jcabi/log/VerboseThreads.java ...
Reading src/main/java/com/jcabi/log/Wrap.java ...
Reading src/main/java/com/jcabi/log/package-info.java ...
Reading src/site/apt/decors.apt.vm ...
Reading src/site/apt/index.apt.vm ...
Reading src/site/apt/multicolor.apt.vm ...
Reading src/site/apt/threads-VerboseProcess.apt.vm ...
Reading src/site/apt/threads-VerboseRunnable.apt.vm ...
Reading src/site/apt/threads-VerboseThreads.apt.vm ...
Reading src/site/resources/CNAME ...
Reading src/site/site.xml ...
Reading src/test/java/com/jcabi/log/ConversionPatternTest.java ...
Reading src/test/java/com/jcabi/log/DecorMocker.java ...
Reading src/test/java/com/jcabi/log/DecorsManagerTest.java ...
Reading src/test/java/com/jcabi/log/DomDecorTest.java ...
Reading src/test/java/com/jcabi/log/ExceptionDecorTest.java ...
Reading src/test/java/com/jcabi/log/FileDecorTest.java ...
Reading src/test/java/com/jcabi/log/LineNumberTest.java ...
Reading src/test/java/com/jcabi/log/ListDecorTest.java ...
Reading src/test/java/com/jcabi/log/Logged.java ...
Reading src/test/java/com/jcabi/log/LoggerTest.java ...
Reading src/test/java/com/jcabi/log/MsDecorTest.java ...
Reading src/test/java/com/jcabi/log/MulticolorLayoutTest.java ...
Reading src/test/java/com/jcabi/log/NanoDecorTest.java ...
Reading src/test/java/com/jcabi/log/NoArgTest.java ...
Reading src/test/java/com/jcabi/log/ObjectDecorTest.java ...
Reading src/test/java/com/jcabi/log/ParseableInformationTest.java ...
Reading src/test/java/com/jcabi/log/ParseableLevelInformationTest.java ...
Reading src/test/java/com/jcabi/log/PreFormatterTest.java ...
Reading src/test/java/com/jcabi/log/Printed.java ...
Reading src/test/java/com/jcabi/log/SecretDecorTest.java ...
Reading src/test/java/com/jcabi/log/SizeDecorTest.java ...
Reading src/test/java/com/jcabi/log/SupplierLoggerTest.java ...
Puzzle 100-e041f047 30/DEV at src/test/java/com/jcabi/log/SupplierLoggerTest.java
Reading src/test/java/com/jcabi/log/TextDecorTest.java ...
Reading src/test/java/com/jcabi/log/TypeDecorTest.java ...
Reading src/test/java/com/jcabi/log/UnitTestAppender.java ...
Reading src/test/java/com/jcabi/log/VerboseCallableTest.java ...
Reading src/test/java/com/jcabi/log/VerboseProcessTest.java ...
Puzzle 18-de8643f2 0/DEV at src/test/java/com/jcabi/log/VerboseProcessTest.java
Reading src/test/java/com/jcabi/log/VerboseRunnableTest.java ...
Reading src/test/java/com/jcabi/log/VerboseThreadsTest.java ...
Reading src/test/java/com/jcabi/log/package-info.java ...
Reading src/test/resources/log4j.properties ...
0m0m[INFO] Error stacktraces are turned on.
[INFO] Scanning for projects...
[INFO]
[INFO] ------------------------< com.jcabi:jcabi-log >-------------------------
[INFO] Building jcabi-log 1.0-SNAPSHOT
[INFO]   from pom.xml
[INFO] -------------------------------[ bundle ]-------------------------------
[INFO] Artifact log4j:log4j:jar:1.2.17 is present in the local repository, but cached from a remote repository ID that is unavailable in current build context, verifying that is downloadable from [central (https://repo.maven.apache.org/maven2, default, releases)]
[INFO] Artifact org.apache.commons:commons-lang3:jar:3.20.0 is present in the local repository, but cached from a remote repository ID that is unavailable in current build context, verifying that is downloadable from [central (https://repo.maven.apache.org/maven2, default, releases)]
[INFO] Artifact log4j:log4j:jar:1.2.17 is present in the local repository, but cached from a remote repository ID that is unavailable in current build context, verifying that is downloadable from [central (https://repo.maven.apache.org/maven2, default, releases)]
[INFO] Artifact org.apache.commons:commons-lang3:jar:3.20.0 is present in the local repository, but cached from a remote repository ID that is unavailable in current build context, verifying that is downloadable from [central (https://repo.maven.apache.org/maven2, default, releases)]
[INFO]
[INFO] --- clean:3.5.0:clean (default-clean) @ jcabi-log ---
[INFO]
[INFO] --- enforcer:3.6.3:enforce (enforce-maven) @ jcabi-log ---
[INFO] Rule 0: org.apache.maven.enforcer.rules.version.RequireMavenVersion passed
[INFO]
[INFO] --- enforcer:3.6.3:enforce (enforce-deps) @ jcabi-log ---
[INFO] Rule 0: org.apache.maven.enforcer.rules.dependency.RequireUpperBoundDeps passed
[INFO]
[INFO] --- buildnumber:3.3.0:create (jcabi-build-number) @ jcabi-log ---
[INFO] ShortRevision tag detected. The value is '7'.
[INFO] Storing buildNumber: 003f938 at timestamp: 2026-09-26T03:39:11
[INFO] Storing scmBranch: master
[INFO]
[INFO] --- buildnumber:3.3.0:create-timestamp (jcabi-build-number) @ jcabi-log ---
[INFO] Skipping because we are not in root module.
[INFO]
[INFO] --- resources:3.5.0:resources (default-resources) @ jcabi-log ---
[INFO] skip non existing resourceDirectory /home/r/repo/src/main/resources
[INFO]
[INFO] --- compiler:3.15.0:compile (default-compile) @ jcabi-log ---
[INFO] Recompiling the module because of changed source code.
[INFO] Compiling 36 source files with javac [debug deprecation target 1.8] to target/classes
[INFO]
[INFO] --- resources:3.5.0:testResources (default-testResources) @ jcabi-log ---
[INFO] Copying 1 resource from src/test/resources to target/test-classes
[INFO]
[INFO] --- compiler:3.15.0:testCompile (default-testCompile) @ jcabi-log ---
[INFO] Recompiling the module because of changed dependency.
[INFO] Compiling 29 source files with javac [debug deprecation target 1.8] to target/test-classes
[INFO]
[INFO] --- surefire:3.5.6:test (default-test) @ jcabi-log ---
[INFO] Tests will run in random order. To reproduce ordering use flag -Dsurefire.runOrder.random.seed=1178857900914
[INFO] Surefire report directory: /home/r/repo/target/surefire-reports
[INFO] Using auto detected provider org.apache.maven.surefire.junitplatform.JUnitPlatformProvider
[WARNING] file.encoding cannot be set as system property, use <argLine>-Dfile.encoding=...</argLine> instead
[INFO]
[INFO] -------------------------------------------------------
[INFO]  T E S T S
[INFO] -------------------------------------------------------
[INFO] Running com.jcabi.log.PreFormatterTest
[INFO] Tests run: 5, Failures: 0, Errors: 0, Skipped: 0, Time elapsed: 0.177 s -- in com.jcabi.log.PreFormatterTest
[INFO] Running com.jcabi.log.NanoDecorTest
[INFO] Tests run: 37, Failures: 0, Errors: 0, Skipped: 0, Time elapsed: 0.478 s -- in com.jcabi.log.NanoDecorTest
[INFO] Running com.jcabi.log.ListDecorTest
[INFO] Tests run: 18, Failures: 0, Errors: 0, Skipped: 0, Time elapsed: 0.139 s -- in com.jcabi.log.ListDecorTest
[INFO] Running com.jcabi.log.MsDecorTest
[INFO] Tests run: 17, Failures: 0, Errors: 0, Skipped: 0, Time elapsed: 0.103 s -- in com.jcabi.log.MsDecorTest
[INFO] Running com.jcabi.log.VerboseRunnableTest
[WARN] main com.jcabi.log.VerboseRunnable: Swallowed exception: java.lang.IllegalStateException: java.lang.IllegalArgumentException: boom-2
        at com.jcabi.log.VerboseRunnable$1.run(VerboseRunnable.java:110)
        at com.jcabi.log.VerboseRunnable.run(VerboseRunnable.java:169)
        at com.jcabi.log.VerboseRunnableTest.swallowsExceptionsInCallable(VerboseRunnableTest.java:61)
        at java.base/jdk.internal.reflect.DirectMethodHandleAccessor.invoke(DirectMethodHandleAccessor.java:103)
        at java.base/java.lang.reflect.Method.invoke(Method.java:580)
        at org.junit.platform.commons.util.ReflectionUtils.invokeMethod(ReflectionUtils.java:700)
        at org.junit.platform.commons.support.ReflectionSupport.invokeMethod(ReflectionSupport.java:528)
        at org.junit.jupiter.engine.support.MethodReflectionUtils.invoke(MethodReflectionUtils.java:53)
        at org.junit.jupiter.engine.execution.MethodInvocation.proceed(MethodInvocation.java:61)
        at org.junit.jupiter.engine.execution.InvocationInterceptorChain$ValidatingInvocation.proceed(InvocationInterceptorChain.java:124)
        at org.junit.jupiter.engine.extension.TimeoutExtension.intercept(TimeoutExtension.java:163)
        at org.junit.jupiter.engine.extension.TimeoutExtension.interceptTestableMethod(TimeoutExtension.java:148)
        at org.junit.jupiter.engine.extension.TimeoutExtension.interceptTestMethod(TimeoutExtension.java:86)
        at org.junit.jupiter.engine.execution.InterceptingExecutableInvoker$ReflectiveInterceptorCall.lambda$ofVoidMethod$0(InterceptingExecutableInvoker.java:124)
        at org.junit.jupiter.engine.execution.InterceptingExecutableInvoker.lambda$invoke$0(InterceptingExecutableInvoker.java:105)
        at org.junit.jupiter.engine.execution.InvocationInterceptorChain$InterceptedInvocation.proceed(InvocationInterceptorChain.java:99)
        at org.junit.jupiter.engine.execution.InvocationInterceptorChain.proceed(InvocationInterceptorChain.java:66)
        at org.junit.jupiter.engine.execution.InvocationInterceptorChain.chainAndInvoke(InvocationInterceptorChain.java:47)
        at org.junit.jupiter.engine.execution.InvocationInterceptorChain.invoke(InvocationInterceptorChain.java:39)
        at org.junit.jupiter.engine.execution.InterceptingExecutableInvoker.invoke(InterceptingExecutableInvoker.java:104)
        at org.junit.jupiter.engine.execution.InterceptingExecutableInvoker.invoke(InterceptingExecutableInvoker.java:98)
        at org.junit.jupiter.engine.execution.InterceptingExecutableInvoker.invokeVoid(InterceptingExecutableInvoker.java:71)
        at org.junit.jupiter.engine.descriptor.TestMethodTestDescriptor.lambda$invokeTestMethod$0(TestMethodTestDescriptor.java:219)
        at org.junit.platform.engine.support.hierarchical.ThrowableCollector.execute(ThrowableCollector.java:74)
        at org.junit.jupiter.engine.descriptor.TestMethodTestDescriptor.invokeTestMethod(TestMethodTestDescriptor.java:215)
        at org.junit.jupiter.engine.descriptor.TestMethodTestDescriptor.execute(TestMethodTestDescriptor.java:157)
        at org.junit.jupiter.engine.descriptor.TestMethodTestDescriptor.execute(TestMethodTestDescriptor.java:70)
        at org.junit.platform.engine.support.hierarchical.NodeTestTask.lambda$executeRecursively$2(NodeTestTask.java:176)
        at org.junit.platform.engine.support.hierarchical.ThrowableCollector.execute(ThrowableCollector.java:74)
        at org.junit.platform.engine.support.hierarchical.NodeTestTask.lambda$executeRecursively$1(NodeTestTask.java:166)
        at org.junit.platform.engine.support.hierarchical.Node.around(Node.java:139)
        at org.junit.platform.engine.support.hierarchical.NodeTestTask.lambda$executeRecursively$0(NodeTestTask.java:164)
        at org.junit.platform.engine.support.hierarchical.ThrowableCollector.execute(ThrowableCollector.java:74)
        at org.junit.platform.engine.support.hierarchical.NodeTestTask.executeRecursively(NodeTestTask.java:163)
        at org.junit.platform.engine.support.hierarchical.NodeTestTask.execute(NodeTestTask.java:116)
        at java.base/java.util.ArrayList.forEach(ArrayList.java:1596)
        at org.junit.platform.engine.support.hierarchical.SameThreadHierarchicalTestExecutorService.invokeAll(SameThreadHierarchicalTestExecutorService.java:42)
        at org.junit.platform.engine.support.hierarchical.NodeTestTask.lambda$executeRecursively$2(NodeTestTask.java:180)
        at org.junit.platform.engine.support.hierarchical.ThrowableCollector.execute(ThrowableCollector.java:74)
        at org.junit.platform.engine.support.hierarchical.NodeTestTask.lambda$executeRecursively$1(NodeTestTask.java:166)
        at org.junit.platform.engine.support.hierarchical.Node.around(Node.java:139)
        at org.junit.platform.engine.support.hierarchical.NodeTestTask.lambda$executeRecursively$0(NodeTestTask.java:164)
        at org.junit.platform.engine.support.hierarchical.ThrowableCollector.execute(ThrowableCollector.java:74)
        at org.junit.platform.engine.support.hierarchical.NodeTestTask.executeRecursively(NodeTestTask.java:163)
        at org.junit.platform.engine.support.hierarchical.NodeTestTask.execute(NodeTestTask.java:116)
        at java.base/java.util.ArrayList.forEach(ArrayList.java:1596)
        at org.junit.platform.engine.support.hierarchical.SameThreadHierarchicalTestExecutorService.invokeAll(SameThreadHierarchicalTestExecutorService.java:42)
        at org.junit.platform.engine.support.hierarchical.NodeTestTask.lambda$executeRecursively$2(NodeTestTask.java:180)
        at org.junit.platform.engine.support.hierarchical.ThrowableCollector.execute(ThrowableCollector.java:74)
        at org.junit.platform.engine.support.hierarchical.NodeTestTask.lambda$executeRecursively$1(NodeTestTask.java:166)
        at org.junit.platform.engine.support.hierarchical.Node.around(Node.java:139)
        at org.junit.platform.engine.support.hierarchical.NodeTestTask.lambda$executeRecursively$0(NodeTestTask.java:164)
        at org.junit.platform.engine.support.hierarchical.ThrowableCollector.execute(ThrowableCollector.java:74)
        at org.junit.platform.engine.support.hierarchical.NodeTestTask.executeRecursively(NodeTestTask.java:163)
        at org.junit.platform.engine.support.hierarchical.NodeTestTask.execute(NodeTestTask.java:116)
        at org.junit.platform.engine.support.hierarchical.SameThreadHierarchicalTestExecutorService.submit(SameThreadHierarchicalTestExecutorService.java:36)
        at org.junit.platform.engine.support.hierarchical.HierarchicalTestExecutor.execute(HierarchicalTestExecutor.java:52)
        at org.junit.platform.engine.support.hierarchical.HierarchicalTestEngine.execute(HierarchicalTestEngine.java:58)
        at org.junit.platform.launcher.core.EngineExecutionOrchestrator.executeEngine(EngineExecutionOrchestrator.java:256)
        at org.junit.platform.launcher.core.EngineExecutionOrchestrator.failOrExecuteEngine(EngineExecutionOrchestrator.java:228)
        at org.junit.platform.launcher.core.EngineExecutionOrchestrator.execute(EngineExecutionOrchestrator.java:189)
        at org.junit.platform.launcher.core.EngineExecutionOrchestrator.execute(EngineExecutionOrchestrator.java:109)
        at org.junit.platform.launcher.core.EngineExecutionOrchestrator.lambda$execute$0(EngineExecutionOrchestrator.java:66)
        at org.junit.platform.launcher.core.EngineExecutionOrchestrator.withInterceptedStreams(EngineExecutionOrchestrator.java:168)
        at org.junit.platform.launcher.core.EngineExecutionOrchestrator.execute(EngineExecutionOrchestrator.java:65)
        at org.junit.platform.launcher.core.DefaultLauncher.execute(DefaultLauncher.java:137)
        at org.junit.platform.launcher.core.DefaultLauncher.execute(DefaultLauncher.java:126)
        at org.junit.platform.launcher.core.DelegatingLauncher.execute(DelegatingLauncher.java:71)
        at org.junit.platform.launcher.core.InterceptingLauncher.lambda$execute$2(InterceptingLauncher.java:66)
        at org.junit.platform.launcher.core.ClasspathAlignmentCheckingLauncherInterceptor.intercept(ClasspathAlignmentCheckingLauncherInterceptor.java:25)
        at org.junit.platform.launcher.core.InterceptingLauncher.execute(InterceptingLauncher.java:65)
        at org.junit.platform.launcher.core.DelegatingLauncher.execute(DelegatingLauncher.java:71)
        at java.base/jdk.internal.reflect.DirectMethodHandleAccessor.invoke(DirectMethodHandleAccessor.java:103)
        at java.base/java.lang.reflect.Method.invoke(Method.java:580)
        at org.apache.maven.surefire.api.util.ReflectionUtils.invokeMethodWithArray(ReflectionUtils.java:125)
        at org.apache.maven.surefire.junitplatform.LauncherAdapter.executeWithCancellationToken(LauncherAdapter.java:68)
        at org.apache.maven.surefire.junitplatform.LauncherAdapter.execute(LauncherAdapter.java:54)
        at org.apache.maven.surefire.junitplatform.JUnitPlatformProvider.execute(JUnitPlatformProvider.java:203)
        at org.apache.maven.surefire.junitplatform.JUnitPlatformProvider.invokeAllTests(JUnitPlatformProvider.java:168)
        at org.apache.maven.surefire.junitplatform.JUnitPlatformProvider.invoke(JUnitPlatformProvider.java:136)
        at org.apache.maven.surefire.booter.ForkedBooter.runSuitesInProcess(ForkedBooter.java:385)
        at org.apache.maven.surefire.booter.ForkedBooter.execute(ForkedBooter.java:162)
        at org.apache.maven.surefire.booter.ForkedBooter.run(ForkedBooter.java:507)
        at org.apache.maven.surefire.booter.ForkedBooter.main(ForkedBooter.java:495)
Caused by: java.lang.IllegalArgumentException: boom-2
        at com.jcabi.log.VerboseRunnableTest.lambda$swallowsExceptionsInCallable$3(VerboseRunnableTest.java:58)
        at com.jcabi.log.VerboseRunnable$1.run(VerboseRunnable.java:104)
        ... 83 more

[WARN] main com.jcabi.log.VerboseRunnable: Swallowed exception: java.lang.IllegalArgumentException: boom
        at com.jcabi.log.VerboseRunnableTest.lambda$swallowsExceptionsInRunnable$2(VerboseRunnableTest.java:47)
        at com.jcabi.log.VerboseRunnable.run(VerboseRunnable.java:169)
        at com.jcabi.log.VerboseRunnableTest.swallowsExceptionsInRunnable(VerboseRunnableTest.java:50)
        at java.base/jdk.internal.reflect.DirectMethodHandleAccessor.invoke(DirectMethodHandleAccessor.java:103)
        at java.base/java.lang.reflect.Method.invoke(Method.java:580)
        at org.junit.platform.commons.util.ReflectionUtils.invokeMethod(ReflectionUtils.java:700)
        at org.junit.platform.commons.support.ReflectionSupport.invokeMethod(ReflectionSupport.java:528)
        at org.junit.jupiter.engine.support.MethodReflectionUtils.invoke(MethodReflectionUtils.java:53)
        at org.junit.jupiter.engine.execution.MethodInvocation.proceed(MethodInvocation.java:61)
        at org.junit.jupiter.engine.execution.InvocationInterceptorChain$ValidatingInvocation.proceed(InvocationInterceptorChain.java:124)
        at org.junit.jupiter.engine.extension.TimeoutExtension.intercept(TimeoutExtension.java:163)
        at org.junit.jupiter.engine.extension.TimeoutExtension.interceptTestableMethod(TimeoutExtension.java:148)
        at org.junit.jupiter.engine.extension.TimeoutExtension.interceptTestMethod(TimeoutExtension.java:86)
        at org.junit.jupiter.engine.execution.InterceptingExecutableInvoker$ReflectiveInterceptorCall.lambda$ofVoidMethod$0(InterceptingExecutableInvoker.java:124)
        at org.junit.jupiter.engine.execution.InterceptingExecutableInvoker.lambda$invoke$0(InterceptingExecutableInvoker.java:105)
        at org.junit.jupiter.engine.execution.InvocationInterceptorChain$InterceptedInvocation.proceed(InvocationInterceptorChain.java:99)
        at org.junit.jupiter.engine.execution.InvocationInterceptorChain.proceed(InvocationInterceptorChain.java:66)
        at org.junit.jupiter.engine.execution.InvocationInterceptorChain.chainAndInvoke(InvocationInterceptorChain.java:47)
        at org.junit.jupiter.engine.execution.InvocationInterceptorChain.invoke(InvocationInterceptorChain.java:39)
        at org.junit.jupiter.engine.execution.InterceptingExecutableInvoker.invoke(InterceptingExecutableInvoker.java:104)
        at org.junit.jupiter.engine.execution.InterceptingExecutableInvoker.invoke(InterceptingExecutableInvoker.java:98)
        at org.junit.jupiter.engine.execution.InterceptingExecutableInvoker.invokeVoid(InterceptingExecutableInvoker.java:71)
        at org.junit.jupiter.engine.descriptor.TestMethodTestDescriptor.lambda$invokeTestMethod$0(TestMethodTestDescriptor.java:219)
        at org.junit.platform.engine.support.hierarchical.ThrowableCollector.execute(ThrowableCollector.java:74)
        at org.junit.jupiter.engine.descriptor.TestMethodTestDescriptor.invokeTestMethod(TestMethodTestDescriptor.java:215)
        at org.junit.jupiter.engine.descriptor.TestMethodTestDescriptor.execute(TestMethodTestDescriptor.java:157)
        at org.junit.jupiter.engine.descriptor.TestMethodTestDescriptor.execute(TestMethodTestDescriptor.java:70)
        at org.junit.platform.engine.support.hierarchical.NodeTestTask.lambda$executeRecursively$2(NodeTestTask.java:176)
        at org.junit.platform.engine.support.hierarchical.ThrowableCollector.execute(ThrowableCollector.java:74)
        at org.junit.platform.engine.support.hierarchical.NodeTestTask.lambda$executeRecursively$1(NodeTestTask.java:166)
        at org.junit.platform.engine.support.hierarchical.Node.around(Node.java:139)
        at org.junit.platform.engine.support.hierarchical.NodeTestTask.lambda$executeRecursively$0(NodeTestTask.java:164)
        at org.junit.platform.engine.support.hierarchical.ThrowableCollector.execute(ThrowableCollector.java:74)
        at org.junit.platform.engine.support.hierarchical.NodeTestTask.executeRecursively(NodeTestTask.java:163)
        at org.junit.platform.engine.support.hierarchical.NodeTestTask.execute(NodeTestTask.java:116)
        at java.base/java.util.ArrayList.forEach(ArrayList.java:1596)
        at org.junit.platform.engine.support.hierarchical.SameThreadHierarchicalTestExecutorService.invokeAll(SameThreadHierarchicalTestExecutorService.java:42)
        at org.junit.platform.engine.support.hierarchical.NodeTestTask.lambda$executeRecursively$2(NodeTestTask.java:180)
        at org.junit.platform.engine.support.hierarchical.ThrowableCollector.execute(ThrowableCollector.java:74)
        at org.junit.platform.engine.support.hierarchical.NodeTestTask.lambda$executeRecursively$1(NodeTestTask.java:166)
        at org.junit.platform.engine.support.hierarchical.Node.around(Node.java:139)
        at org.junit.platform.engine.support.hierarchical.NodeTestTask.lambda$executeRecursively$0(NodeTestTask.java:164)
        at org.junit.platform.engine.support.hierarchical.ThrowableCollector.execute(ThrowableCollector.java:74)
        at org.junit.platform.engine.support.hierarchical.NodeTestTask.executeRecursively(NodeTestTask.java:163)
        at org.junit.platform.engine.support.hierarchical.NodeTestTask.execute(NodeTestTask.java:116)
        at java.base/java.util.ArrayList.forEach(ArrayList.java:1596)
        at org.junit.platform.engine.support.hierarchical.SameThreadHierarchicalTestExecutorService.invokeAll(SameThreadHierarchicalTestExecutorService.java:42)
        at org.junit.platform.engine.support.hierarchical.NodeTestTask.lambda$executeRecursively$2(NodeTestTask.java:180)
        at org.junit.platform.engine.support.hierarchical.ThrowableCollector.execute(ThrowableCollector.java:74)
        at org.junit.platform.engine.support.hierarchical.NodeTestTask.lambda$executeRecursively$1(NodeTestTask.java:166)
        at org.junit.platform.engine.support.hierarchical.Node.around(Node.java:139)
        at org.junit.platform.engine.support.hierarchical.NodeTestTask.lambda$executeRecursively$0(NodeTestTask.java:164)
        at org.junit.platform.engine.support.hierarchical.ThrowableCollector.execute(ThrowableCollector.java:74)
        at org.junit.platform.engine.support.hierarchical.NodeTestTask.executeRecursively(NodeTestTask.java:163)
        at org.junit.platform.engine.support.hierarchical.NodeTestTask.execute(NodeTestTask.java:116)
        at org.junit.platform.engine.support.hierarchical.SameThreadHierarchicalTestExecutorService.submit(SameThreadHierarchicalTestExecutorService.java:36)
        at org.junit.platform.engine.support.hierarchical.HierarchicalTestExecutor.execute(HierarchicalTestExecutor.java:52)
        at org.junit.platform.engine.support.hierarchical.HierarchicalTestEngine.execute(HierarchicalTestEngine.java:58)
        at org.junit.platform.launcher.core.EngineExecutionOrchestrator.executeEngine(EngineExecutionOrchestrator.java:256)
        at org.junit.platform.launcher.core.EngineExecutionOrchestrator.failOrExecuteEngine(EngineExecutionOrchestrator.java:228)
        at org.junit.platform.launcher.core.EngineExecutionOrchestrator.execute(EngineExecutionOrchestrator.java:189)
        at org.junit.platform.launcher.core.EngineExecutionOrchestrator.execute(EngineExecutionOrchestrator.java:109)
        at org.junit.platform.launcher.core.EngineExecutionOrchestrator.lambda$execute$0(EngineExecutionOrchestrator.java:66)
        at org.junit.platform.launcher.core.EngineExecutionOrchestrator.withInterceptedStreams(EngineExecutionOrchestrator.java:168)
        at org.junit.platform.launcher.core.EngineExecutionOrchestrator.execute(EngineExecutionOrchestrator.java:65)
        at org.junit.platform.launcher.core.DefaultLauncher.execute(DefaultLauncher.java:137)
        at org.junit.platform.launcher.core.DefaultLauncher.execute(DefaultLauncher.java:126)
        at org.junit.platform.launcher.core.DelegatingLauncher.execute(DelegatingLauncher.java:71)
        at org.junit.platform.launcher.core.InterceptingLauncher.lambda$execute$2(InterceptingLauncher.java:66)
        at org.junit.platform.launcher.core.ClasspathAlignmentCheckingLauncherInterceptor.intercept(ClasspathAlignmentCheckingLauncherInterceptor.java:25)
        at org.junit.platform.launcher.core.InterceptingLauncher.execute(InterceptingLauncher.java:65)
        at org.junit.platform.launcher.core.DelegatingLauncher.execute(DelegatingLauncher.java:71)
        at java.base/jdk.internal.reflect.DirectMethodHandleAccessor.invoke(DirectMethodHandleAccessor.java:103)
        at java.base/java.lang.reflect.Method.invoke(Method.java:580)
        at org.apache.maven.surefire.api.util.ReflectionUtils.invokeMethodWithArray(ReflectionUtils.java:125)
        at org.apache.maven.surefire.junitplatform.LauncherAdapter.executeWithCancellationToken(LauncherAdapter.java:68)
        at org.apache.maven.surefire.junitplatform.LauncherAdapter.execute(LauncherAdapter.java:54)
        at org.apache.maven.surefire.junitplatform.JUnitPlatformProvider.execute(JUnitPlatformProvider.java:203)
        at org.apache.maven.surefire.junitplatform.JUnitPlatformProvider.invokeAllTests(JUnitPlatformProvider.java:168)
        at org.apache.maven.surefire.junitplatform.JUnitPlatformProvider.invoke(JUnitPlatformProvider.java:136)
        at org.apache.maven.surefire.booter.ForkedBooter.runSuitesInProcess(ForkedBooter.java:385)
        at org.apache.maven.surefire.booter.ForkedBooter.execute(ForkedBooter.java:162)
        at org.apache.maven.surefire.booter.ForkedBooter.run(ForkedBooter.java:507)
        at org.apache.maven.surefire.booter.ForkedBooter.main(ForkedBooter.java:495)

[WARN] pool-2-thread-1 com.jcabi.log.VerboseRunnable: Swallowed exception: java.lang.IllegalStateException('java.lang.InterruptedException: sleep interrupted')
[WARN] main com.jcabi.log.VerboseRunnable: Escalated exception: java.lang.IllegalArgumentException: oops
        at com.jcabi.log.VerboseRunnableTest.lambda$logsExceptionsInRunnable$0(VerboseRunnableTest.java:37)
        at com.jcabi.log.VerboseRunnable.run(VerboseRunnable.java:169)
        at com.jcabi.log.VerboseRunnableTest.lambda$logsExceptionsInRunnable$1(VerboseRunnableTest.java:39)
        at org.junit.jupiter.api.AssertThrows.assertThrows(AssertThrows.java:54)
        at org.junit.jupiter.api.AssertThrows.assertThrows(AssertThrows.java:35)
        at org.junit.jupiter.api.Assertions.assertThrows(Assertions.java:3234)
        at com.jcabi.log.VerboseRunnableTest.logsExceptionsInRunnable(VerboseRunnableTest.java:33)
        at java.base/jdk.internal.reflect.DirectMethodHandleAccessor.invoke(DirectMethodHandleAccessor.java:103)
        at java.base/java.lang.reflect.Method.invoke(Method.java:580)
        at org.junit.platform.commons.util.ReflectionUtils.invokeMethod(ReflectionUtils.java:700)
        at org.junit.platform.commons.support.ReflectionSupport.invokeMethod(ReflectionSupport.java:528)
        at org.junit.jupiter.engine.support.MethodReflectionUtils.invoke(MethodReflectionUtils.java:53)
        at org.junit.jupiter.engine.execution.MethodInvocation.proceed(MethodInvocation.java:61)
        at org.junit.jupiter.engine.execution.InvocationInterceptorChain$ValidatingInvocation.proceed(InvocationInterceptorChain.java:124)
        at org.junit.jupiter.engine.extension.TimeoutExtension.intercept(TimeoutExtension.java:163)
        at org.junit.jupiter.engine.extension.TimeoutExtension.interceptTestableMethod(TimeoutExtension.java:148)
        at org.junit.jupiter.engine.extension.TimeoutExtension.interceptTestMethod(TimeoutExtension.java:86)
        at org.junit.jupiter.engine.execution.InterceptingExecutableInvoker$ReflectiveInterceptorCall.lambda$ofVoidMethod$0(InterceptingExecutableInvoker.java:124)
        at org.junit.jupiter.engine.execution.InterceptingExecutableInvoker.lambda$invoke$0(InterceptingExecutableInvoker.java:105)
        at org.junit.jupiter.engine.execution.InvocationInterceptorChain$InterceptedInvocation.proceed(InvocationInterceptorChain.java:99)
        at org.junit.jupiter.engine.execution.InvocationInterceptorChain.proceed(InvocationInterceptorChain.java:66)
        at org.junit.jupiter.engine.execution.InvocationInterceptorChain.chainAndInvoke(InvocationInterceptorChain.java:47)
        at org.junit.jupiter.engine.execution.InvocationInterceptorChain.invoke(InvocationInterceptorChain.java:39)
        at org.junit.jupiter.engine.execution.InterceptingExecutableInvoker.invoke(InterceptingExecutableInvoker.java:104)
        at org.junit.jupiter.engine.execution.InterceptingExecutableInvoker.invoke(InterceptingExecutableInvoker.java:98)
        at org.junit.jupiter.engine.execution.InterceptingExecutableInvoker.invokeVoid(InterceptingExecutableInvoker.java:71)
        at org.junit.jupiter.engine.descriptor.TestMethodTestDescriptor.lambda$invokeTestMethod$0(TestMethodTestDescriptor.java:219)
        at org.junit.platform.engine.support.hierarchical.ThrowableCollector.execute(ThrowableCollector.java:74)
        at org.junit.jupiter.engine.descriptor.TestMethodTestDescriptor.invokeTestMethod(TestMethodTestDescriptor.java:215)
        at org.junit.jupiter.engine.descriptor.TestMethodTestDescriptor.execute(TestMethodTestDescriptor.java:157)
        at org.junit.jupiter.engine.descriptor.TestMethodTestDescriptor.execute(TestMethodTestDescriptor.java:70)
        at org.junit.platform.engine.support.hierarchical.NodeTestTask.lambda$executeRecursively$2(NodeTestTask.java:176)
        at org.junit.platform.engine.support.hierarchical.ThrowableCollector.execute(ThrowableCollector.java:74)
        at org.junit.platform.engine.support.hierarchical.NodeTestTask.lambda$executeRecursively$1(NodeTestTask.java:166)
        at org.junit.platform.engine.support.hierarchical.Node.around(Node.java:139)
        at org.junit.platform.engine.support.hierarchical.NodeTestTask.lambda$executeRecursively$0(NodeTestTask.java:164)
        at org.junit.platform.engine.support.hierarchical.ThrowableCollector.execute(ThrowableCollector.java:74)
        at org.junit.platform.engine.support.hierarchical.NodeTestTask.executeRecursively(NodeTestTask.java:163)
        at org.junit.platform.engine.support.hierarchical.NodeTestTask.execute(NodeTestTask.java:116)
        at java.base/java.util.ArrayList.forEach(ArrayList.java:1596)
        at org.junit.platform.engine.support.hierarchical.SameThreadHierarchicalTestExecutorService.invokeAll(SameThreadHierarchicalTestExecutorService.java:42)
        at org.junit.platform.engine.support.hierarchical.NodeTestTask.lambda$executeRecursively$2(NodeTestTask.java:180)
        at org.junit.platform.engine.support.hierarchical.ThrowableCollector.execute(ThrowableCollector.java:74)
        at org.junit.platform.engine.support.hierarchical.NodeTestTask.lambda$executeRecursively$1(NodeTestTask.java:166)
        at org.junit.platform.engine.support.hierarchical.Node.around(Node.java:139)
        at org.junit.platform.engine.support.hierarchical.NodeTestTask.lambda$executeRecursively$0(NodeTestTask.java:164)
        at org.junit.platform.engine.support.hierarchical.ThrowableCollector.execute(ThrowableCollector.java:74)
        at org.junit.platform.engine.support.hierarchical.NodeTestTask.executeRecursively(NodeTestTask.java:163)
        at org.junit.platform.engine.support.hierarchical.NodeTestTask.execute(NodeTestTask.java:116)
        at java.base/java.util.ArrayList.forEach(ArrayList.java:1596)
        at org.junit.platform.engine.support.hierarchical.SameThreadHierarchicalTestExecutorService.invokeAll(SameThreadHierarchicalTestExecutorService.java:42)
        at org.junit.platform.engine.support.hierarchical.NodeTestTask.lambda$executeRecursively$2(NodeTestTask.java:180)
        at org.junit.platform.engine.support.hierarchical.ThrowableCollector.execute(ThrowableCollector.java:74)
        at org.junit.platform.engine.support.hierarchical.NodeTestTask.lambda$executeRecursively$1(NodeTestTask.java:166)
        at org.junit.platform.engine.support.hierarchical.Node.around(Node.java:139)
        at org.junit.platform.engine.support.hierarchical.NodeTestTask.lambda$executeRecursively$0(NodeTestTask.java:164)
        at org.junit.platform.engine.support.hierarchical.ThrowableCollector.execute(ThrowableCollector.java:74)
        at org.junit.platform.engine.support.hierarchical.NodeTestTask.executeRecursively(NodeTestTask.java:163)
        at org.junit.platform.engine.support.hierarchical.NodeTestTask.execute(NodeTestTask.java:116)
        at org.junit.platform.engine.support.hierarchical.SameThreadHierarchicalTestExecutorService.submit(SameThreadHierarchicalTestExecutorService.java:36)
        at org.junit.platform.engine.support.hierarchical.HierarchicalTestExecutor.execute(HierarchicalTestExecutor.java:52)
        at org.junit.platform.engine.support.hierarchical.HierarchicalTestEngine.execute(HierarchicalTestEngine.java:58)
        at org.junit.platform.launcher.core.EngineExecutionOrchestrator.executeEngine(EngineExecutionOrchestrator.java:256)
        at org.junit.platform.launcher.core.EngineExecutionOrchestrator.failOrExecuteEngine(EngineExecutionOrchestrator.java:228)
        at org.junit.platform.launcher.core.EngineExecutionOrchestrator.execute(EngineExecutionOrchestrator.java:189)
        at org.junit.platform.launcher.core.EngineExecutionOrchestrator.execute(EngineExecutionOrchestrator.java:109)
        at org.junit.platform.launcher.core.EngineExecutionOrchestrator.lambda$execute$0(EngineExecutionOrchestrator.java:66)
        at org.junit.platform.launcher.core.EngineExecutionOrchestrator.withInterceptedStreams(EngineExecutionOrchestrator.java:168)
        at org.junit.platform.launcher.core.EngineExecutionOrchestrator.execute(EngineExecutionOrchestrator.java:65)
        at org.junit.platform.launcher.core.DefaultLauncher.execute(DefaultLauncher.java:137)
        at org.junit.platform.launcher.core.DefaultLauncher.execute(DefaultLauncher.java:126)
        at org.junit.platform.launcher.core.DelegatingLauncher.execute(DelegatingLauncher.java:71)
        at org.junit.platform.launcher.core.InterceptingLauncher.lambda$execute$2(InterceptingLauncher.java:66)
        at org.junit.platform.launcher.core.ClasspathAlignmentCheckingLauncherInterceptor.intercept(ClasspathAlignmentCheckingLauncherInterceptor.java:25)
        at org.junit.platform.launcher.core.InterceptingLauncher.execute(InterceptingLauncher.java:65)
        at org.junit.platform.launcher.core.DelegatingLauncher.execute(DelegatingLauncher.java:71)
        at java.base/jdk.internal.reflect.DirectMethodHandleAccessor.invoke(DirectMethodHandleAccessor.java:103)
        at java.base/java.lang.reflect.Method.invoke(Method.java:580)
        at org.apache.maven.surefire.api.util.ReflectionUtils.invokeMethodWithArray(ReflectionUtils.java:125)
        at org.apache.maven.surefire.junitplatform.LauncherAdapter.executeWithCancellationToken(LauncherAdapter.java:68)
        at org.apache.maven.surefire.junitplatform.LauncherAdapter.execute(LauncherAdapter.java:54)
        at org.apache.maven.surefire.junitplatform.JUnitPlatformProvider.execute(JUnitPlatformProvider.java:203)
        at org.apache.maven.surefire.junitplatform.JUnitPlatformProvider.invokeAllTests(JUnitPlatformProvider.java:168)
        at org.apache.maven.surefire.junitplatform.JUnitPlatformProvider.invoke(JUnitPlatformProvider.java:136)
        at org.apache.maven.surefire.booter.ForkedBooter.runSuitesInProcess(ForkedBooter.java:385)
        at org.apache.maven.surefire.booter.ForkedBooter.execute(ForkedBooter.java:162)
        at org.apache.maven.surefire.booter.ForkedBooter.run(ForkedBooter.java:507)
        at org.apache.maven.surefire.booter.ForkedBooter.main(ForkedBooter.java:495)

[INFO] Tests run: 6, Failures: 0, Errors: 0, Skipped: 0, Time elapsed: 1.219 s -- in com.jcabi.log.VerboseRunnableTest
[INFO] Running com.jcabi.log.ExceptionDecorTest
Mockito is currently self-attaching to enable the inline-mock-maker. This will no longer work in future releases of the JDK. Please add Mockito as an agent to your build as described in Mockito's documentation: https://javadoc.io/doc/org.mockito/mockito-core/latest/org.mockito/org/mockito/Mockito.html#0.3
WARNING: A Java agent has been loaded dynamically (/home/r/.m2/repository/net/bytebuddy/byte-buddy-agent/1.17.7/byte-buddy-agent-1.17.7.jar)
WARNING: If a serviceability tool is in use, please run with -XX:+EnableDynamicAgentLoading to hide this warning
WARNING: If a serviceability tool is not in use, please run with -Djdk.instrument.traceUsage for more information
WARNING: Dynamic loading of agents will be disallowed by default in a future release
OpenJDK 64-Bit Server VM warning: Sharing is only supported for boot loader classes because bootstrap classpath has been appended
[INFO] Tests run: 2, Failures: 0, Errors: 0, Skipped: 0, Time elapsed: 1.544 s -- in com.jcabi.log.ExceptionDecorTest
[INFO] Running com.jcabi.log.ObjectDecorTest
[INFO] Tests run: 12, Failures: 0, Errors: 0, Skipped: 0, Time elapsed: 0.188 s -- in com.jcabi.log.ObjectDecorTest
[INFO] Running com.jcabi.log.VerboseCallableTest
[WARN] main com.jcabi.log.VerboseCallable: Escalated runtime exception: java.lang.IllegalArgumentException: oops
        at com.jcabi.log.VerboseCallableTest.lambda$logsExceptionsInCallable$0(VerboseCallableTest.java:26)
        at com.jcabi.log.VerboseCallable.call(VerboseCallable.java:150)
        at com.jcabi.log.VerboseCallableTest.lambda$logsExceptionsInCallable$1(VerboseCallableTest.java:28)
        at org.junit.jupiter.api.AssertThrows.assertThrows(AssertThrows.java:54)
        at org.junit.jupiter.api.AssertThrows.assertThrows(AssertThrows.java:35)
        at org.junit.jupiter.api.Assertions.assertThrows(Assertions.java:3234)
        at com.jcabi.log.VerboseCallableTest.logsExceptionsInCallable(VerboseCallableTest.java:22)
        at java.base/jdk.internal.reflect.DirectMethodHandleAccessor.invoke(DirectMethodHandleAccessor.java:103)
        at java.base/java.lang.reflect.Method.invoke(Method.java:580)
        at org.junit.platform.commons.util.ReflectionUtils.invokeMethod(ReflectionUtils.java:700)
        at org.junit.platform.commons.support.ReflectionSupport.invokeMethod(ReflectionSupport.java:528)
        at org.junit.jupiter.engine.support.MethodReflectionUtils.invoke(MethodReflectionUtils.java:53)
        at org.junit.jupiter.engine.execution.MethodInvocation.proceed(MethodInvocation.java:61)
        at org.junit.jupiter.engine.execution.InvocationInterceptorChain$ValidatingInvocation.proceed(InvocationInterceptorChain.java:124)
        at org.junit.jupiter.engine.extension.TimeoutExtension.intercept(TimeoutExtension.java:163)
        at org.junit.jupiter.engine.extension.TimeoutExtension.interceptTestableMethod(TimeoutExtension.java:148)
        at org.junit.jupiter.engine.extension.TimeoutExtension.interceptTestMethod(TimeoutExtension.java:86)
        at org.junit.jupiter.engine.execution.InterceptingExecutableInvoker$ReflectiveInterceptorCall.lambda$ofVoidMethod$0(InterceptingExecutableInvoker.java:124)
        at org.junit.jupiter.engine.execution.InterceptingExecutableInvoker.lambda$invoke$0(InterceptingExecutableInvoker.java:105)
        at org.junit.jupiter.engine.execution.InvocationInterceptorChain$InterceptedInvocation.proceed(InvocationInterceptorChain.java:99)
        at org.junit.jupiter.engine.execution.InvocationInterceptorChain.proceed(InvocationInterceptorChain.java:66)
        at org.junit.jupiter.engine.execution.InvocationInterceptorChain.chainAndInvoke(InvocationInterceptorChain.java:47)
        at org.junit.jupiter.engine.execution.InvocationInterceptorChain.invoke(InvocationInterceptorChain.java:39)
        at org.junit.jupiter.engine.execution.InterceptingExecutableInvoker.invoke(InterceptingExecutableInvoker.java:104)
        at org.junit.jupiter.engine.execution.InterceptingExecutableInvoker.invoke(InterceptingExecutableInvoker.java:98)
        at org.junit.jupiter.engine.execution.InterceptingExecutableInvoker.invokeVoid(InterceptingExecutableInvoker.java:71)
        at org.junit.jupiter.engine.descriptor.TestMethodTestDescriptor.lambda$invokeTestMethod$0(TestMethodTestDescriptor.java:219)
        at org.junit.platform.engine.support.hierarchical.ThrowableCollector.execute(ThrowableCollector.java:74)
        at org.junit.jupiter.engine.descriptor.TestMethodTestDescriptor.invokeTestMethod(TestMethodTestDescriptor.java:215)
        at org.junit.jupiter.engine.descriptor.TestMethodTestDescriptor.execute(TestMethodTestDescriptor.java:157)
        at org.junit.jupiter.engine.descriptor.TestMethodTestDescriptor.execute(TestMethodTestDescriptor.java:70)
        at org.junit.platform.engine.support.hierarchical.NodeTestTask.lambda$executeRecursively$2(NodeTestTask.java:176)
        at org.junit.platform.engine.support.hierarchical.ThrowableCollector.execute(ThrowableCollector.java:74)
        at org.junit.platform.engine.support.hierarchical.NodeTestTask.lambda$executeRecursively$1(NodeTestTask.java:166)
        at org.junit.platform.engine.support.hierarchical.Node.around(Node.java:139)
        at org.junit.platform.engine.support.hierarchical.NodeTestTask.lambda$executeRecursively$0(NodeTestTask.java:164)
        at org.junit.platform.engine.support.hierarchical.ThrowableCollector.execute(ThrowableCollector.java:74)
        at org.junit.platform.engine.support.hierarchical.NodeTestTask.executeRecursively(NodeTestTask.java:163)
        at org.junit.platform.engine.support.hierarchical.NodeTestTask.execute(NodeTestTask.java:116)
        at java.base/java.util.ArrayList.forEach(ArrayList.java:1596)
        at org.junit.platform.engine.support.hierarchical.SameThreadHierarchicalTestExecutorService.invokeAll(SameThreadHierarchicalTestExecutorService.java:42)
        at org.junit.platform.engine.support.hierarchical.NodeTestTask.lambda$executeRecursively$2(NodeTestTask.java:180)
        at org.junit.platform.engine.support.hierarchical.ThrowableCollector.execute(ThrowableCollector.java:74)
        at org.junit.platform.engine.support.hierarchical.NodeTestTask.lambda$executeRecursively$1(NodeTestTask.java:166)
        at org.junit.platform.engine.support.hierarchical.Node.around(Node.java:139)
        at org.junit.platform.engine.support.hierarchical.NodeTestTask.lambda$executeRecursively$0(NodeTestTask.java:164)
        at org.junit.platform.engine.support.hierarchical.ThrowableCollector.execute(ThrowableCollector.java:74)
        at org.junit.platform.engine.support.hierarchical.NodeTestTask.executeRecursively(NodeTestTask.java:163)
        at org.junit.platform.engine.support.hierarchical.NodeTestTask.execute(NodeTestTask.java:116)
        at java.base/java.util.ArrayList.forEach(ArrayList.java:1596)
        at org.junit.platform.engine.support.hierarchical.SameThreadHierarchicalTestExecutorService.invokeAll(SameThreadHierarchicalTestExecutorService.java:42)
        at org.junit.platform.engine.support.hierarchical.NodeTestTask.lambda$executeRecursively$2(NodeTestTask.java:180)
        at org.junit.platform.engine.support.hierarchical.ThrowableCollector.execute(ThrowableCollector.java:74)
        at org.junit.platform.engine.support.hierarchical.NodeTestTask.lambda$executeRecursively$1(NodeTestTask.java:166)
        at org.junit.platform.engine.support.hierarchical.Node.around(Node.java:139)
        at org.junit.platform.engine.support.hierarchical.NodeTestTask.lambda$executeRecursively$0(NodeTestTask.java:164)
        at org.junit.platform.engine.support.hierarchical.ThrowableCollector.execute(ThrowableCollector.java:74)
        at org.junit.platform.engine.support.hierarchical.NodeTestTask.executeRecursively(NodeTestTask.java:163)
        at org.junit.platform.engine.support.hierarchical.NodeTestTask.execute(NodeTestTask.java:116)
        at org.junit.platform.engine.support.hierarchical.SameThreadHierarchicalTestExecutorService.submit(SameThreadHierarchicalTestExecutorService.java:36)
        at org.junit.platform.engine.support.hierarchical.HierarchicalTestExecutor.execute(HierarchicalTestExecutor.java:52)
        at org.junit.platform.engine.support.hierarchical.HierarchicalTestEngine.execute(HierarchicalTestEngine.java:58)
        at org.junit.platform.launcher.core.EngineExecutionOrchestrator.executeEngine(EngineExecutionOrchestrator.java:256)
        at org.junit.platform.launcher.core.EngineExecutionOrchestrator.failOrExecuteEngine(EngineExecutionOrchestrator.java:228)
        at org.junit.platform.launcher.core.EngineExecutionOrchestrator.execute(EngineExecutionOrchestrator.java:189)
        at org.junit.platform.launcher.core.EngineExecutionOrchestrator.execute(EngineExecutionOrchestrator.java:109)
        at org.junit.platform.launcher.core.EngineExecutionOrchestrator.lambda$execute$0(EngineExecutionOrchestrator.java:66)
        at org.junit.platform.launcher.core.EngineExecutionOrchestrator.withInterceptedStreams(EngineExecutionOrchestrator.java:168)
        at org.junit.platform.launcher.core.EngineExecutionOrchestrator.execute(EngineExecutionOrchestrator.java:65)
        at org.junit.platform.launcher.core.DefaultLauncher.execute(DefaultLauncher.java:137)
        at org.junit.platform.launcher.core.DefaultLauncher.execute(DefaultLauncher.java:126)
        at org.junit.platform.launcher.core.DelegatingLauncher.execute(DelegatingLauncher.java:71)
        at org.junit.platform.launcher.core.InterceptingLauncher.lambda$execute$2(InterceptingLauncher.java:66)
        at org.junit.platform.launcher.core.ClasspathAlignmentCheckingLauncherInterceptor.intercept(ClasspathAlignmentCheckingLauncherInterceptor.java:25)
        at org.junit.platform.launcher.core.InterceptingLauncher.execute(InterceptingLauncher.java:65)
        at org.junit.platform.launcher.core.DelegatingLauncher.execute(DelegatingLauncher.java:71)
        at java.base/jdk.internal.reflect.DirectMethodHandleAccessor.invoke(DirectMethodHandleAccessor.java:103)
        at java.base/java.lang.reflect.Method.invoke(Method.java:580)
        at org.apache.maven.surefire.api.util.ReflectionUtils.invokeMethodWithArray(ReflectionUtils.java:125)
        at org.apache.maven.surefire.junitplatform.LauncherAdapter.executeWithCancellationToken(LauncherAdapter.java:68)
        at org.apache.maven.surefire.junitplatform.LauncherAdapter.execute(LauncherAdapter.java:54)
        at org.apache.maven.surefire.junitplatform.JUnitPlatformProvider.execute(JUnitPlatformProvider.java:203)
        at org.apache.maven.surefire.junitplatform.JUnitPlatformProvider.invokeAllTests(JUnitPlatformProvider.java:168)
        at org.apache.maven.surefire.junitplatform.JUnitPlatformProvider.invoke(JUnitPlatformProvider.java:136)
        at org.apache.maven.surefire.booter.ForkedBooter.runSuitesInProcess(ForkedBooter.java:385)
        at org.apache.maven.surefire.booter.ForkedBooter.execute(ForkedBooter.java:162)
        at org.apache.maven.surefire.booter.ForkedBooter.run(ForkedBooter.java:507)
        at org.apache.maven.surefire.booter.ForkedBooter.main(ForkedBooter.java:495)

[INFO] Tests run: 1, Failures: 0, Errors: 0, Skipped: 0, Time elapsed: 0.028 s -- in com.jcabi.log.VerboseCallableTest
[INFO] Running com.jcabi.log.ConversionPatternTest
[INFO] Tests run: 4, Failures: 0, Errors: 0, Skipped: 0, Time elapsed: 0.031 s -- in com.jcabi.log.ConversionPatternTest
[INFO] Running com.jcabi.log.TextDecorTest
[INFO] Tests run: 7, Failures: 0, Errors: 0, Skipped: 0, Time elapsed: 0.079 s -- in com.jcabi.log.TextDecorTest
[INFO] Running com.jcabi.log.SizeDecorTest
[INFO] Tests run: 25, Failures: 0, Errors: 0, Skipped: 0, Time elapsed: 0.156 s -- in com.jcabi.log.SizeDecorTest
[INFO] Running com.jcabi.log.LoggerTest
[INFO] main com.jcabi.log...why.not: hello, world!!
[INFO] main com.jcabi.log.LoggerTest: hello, \xe2\x82\xac, how're\xd0\x8a?
[INFO] main com.jcabi.log.LoggerTest: I'm fine, \x00\x07!
[INFO] Tests run: 11, Failures: 0, Errors: 0, Skipped: 0, Time elapsed: 0.045 s -- in com.jcabi.log.LoggerTest
[INFO] Running com.jcabi.log.NoArgTest
[INFO] Tests run: 5, Failures: 0, Errors: 0, Skipped: 0, Time elapsed: 0.014 s -- in com.jcabi.log.NoArgTest
[INFO] Running com.jcabi.log.FileDecorTest
[WARNING] Tests run: 14, Failures: 0, Errors: 0, Skipped: 1, Time elapsed: 0.095 s -- in com.jcabi.log.FileDecorTest
[INFO] Running com.jcabi.log.ParseableInformationTest
[INFO] Tests run: 2, Failures: 0, Errors: 0, Skipped: 0, Time elapsed: 0.019 s -- in com.jcabi.log.ParseableInformationTest
[INFO] Running com.jcabi.log.SupplierLoggerTest
[TRACE] main enabledtrace: Trace enabled: text4
[WARNING] Tests run: 8, Failures: 0, Errors: 0, Skipped: 3, Time elapsed: 0.110 s -- in com.jcabi.log.SupplierLoggerTest
[INFO] Running com.jcabi.log.SecretDecorTest
[INFO] Tests run: 8, Failures: 0, Errors: 0, Skipped: 0, Time elapsed: 0.042 s -- in com.jcabi.log.SecretDecorTest
[INFO] Running com.jcabi.log.VerboseProcessTest
[DEBUG] main com.jcabi.log.VerboseProcessTest: terminatesMntrsAndPrcssIfClosed delay=400 vrbPrc.hashCode=269257589
[DEBUG] main com.jcabi.log.VerboseProcess: #waitFor(): waiting for stdout of Mock for Process, hashCode: 1372817363 in Thread[#20,VrbPrc.Monitor-269257589-out,5,main]...
[DEBUG] main com.jcabi.log.VerboseProcess: #waitFor(): waiting for stderr of Mock for Process, hashCode: 1372817363 in Thread[#21,VrbPrc.Monitor-269257589-err,5,main]...
[DEBUG] main com.jcabi.log.VerboseProcess: #waitFor(): process finished: Mock for Process, hashCode: 1372817363
[ERROR] main com.jcabi.log.VerboseProcess: #wait() failed
[DEBUG] main com.jcabi.log.VerboseProcess: #stdout(): process Mock for Process, hashCode: 1372817363 completed (code=0, size=3850240) in 2s
[DEBUG] main com.jcabi.log.VerboseProcess: Monitor interrupted
[DEBUG] main com.jcabi.log.VerboseProcess: Monitor interrupted
[DEBUG] main com.jcabi.log.VerboseProcess: Underlying process destroyed
[DEBUG] VrbPrc.Monitor-269257589-out com.jcabi.log.VerboseProcess: Explicitly interrupting read from buffer
[DEBUG] VrbPrc.Monitor-269257589-err com.jcabi.log.VerboseProcess: Explicitly interrupting read from buffer
[DEBUG] main com.jcabi.log.VerboseProcessTest: terminatesMntrsAndPrcssIfClosed delay=0 vrbPrc.hashCode=1037242711
[DEBUG] main com.jcabi.log.VerboseProcess: #waitFor(): waiting for stdout of Mock for Process, hashCode: 505323251 in Thread[#22,VrbPrc.Monitor-1037242711-out,5,main]...
[DEBUG] main com.jcabi.log.VerboseProcess: #waitFor(): waiting for stderr of Mock for Process, hashCode: 505323251 in Thread[#23,VrbPrc.Monitor-1037242711-err,5,main]...
[DEBUG] main com.jcabi.log.VerboseProcess: #waitFor(): process finished: Mock for Process, hashCode: 505323251
[ERROR] main com.jcabi.log.VerboseProcess: #wait() failed
[DEBUG] main com.jcabi.log.VerboseProcess: #stdout(): process Mock for Process, hashCode: 505323251 completed (code=0, size=22495232) in 2s
[DEBUG] main com.jcabi.log.VerboseProcess: Monitor interrupted
[DEBUG] main com.jcabi.log.VerboseProcess: Monitor interrupted
[DEBUG] VrbPrc.Monitor-1037242711-err com.jcabi.log.VerboseProcess: Explicitly interrupting read from buffer
[DEBUG] main com.jcabi.log.VerboseProcess: Underlying process destroyed
[DEBUG] VrbPrc.Monitor-1037242711-out com.jcabi.log.VerboseProcess: Explicitly interrupting read from buffer
[DEBUG] main com.jcabi.log.VerboseProcessTest: terminatesMntrsAndPrcssIfClosed delay=50 vrbPrc.hashCode=2101326063
[DEBUG] main com.jcabi.log.VerboseProcess: #waitFor(): waiting for stdout of Mock for Process, hashCode: 1480805145 in Thread[#24,VrbPrc.Monitor-2101326063-out,5,main]...
[DEBUG] main com.jcabi.log.VerboseProcess: #waitFor(): waiting for stderr of Mock for Process, hashCode: 1480805145 in Thread[#25,VrbPrc.Monitor-2101326063-err,5,main]...
[DEBUG] main com.jcabi.log.VerboseProcess: #waitFor(): process finished: Mock for Process, hashCode: 1480805145
[ERROR] main com.jcabi.log.VerboseProcess: #wait() failed
[DEBUG] main com.jcabi.log.VerboseProcess: #stdout(): process Mock for Process, hashCode: 1480805145 completed (code=0, size=22986752) in 2s
[DEBUG] main com.jcabi.log.VerboseProcess: Monitor interrupted
[DEBUG] main com.jcabi.log.VerboseProcess: Monitor interrupted
[DEBUG] VrbPrc.Monitor-2101326063-err com.jcabi.log.VerboseProcess: Explicitly interrupting read from buffer
[DEBUG] main com.jcabi.log.VerboseProcess: Underlying process destroyed
[DEBUG] VrbPrc.Monitor-2101326063-out com.jcabi.log.VerboseProcess: Explicitly interrupting read from buffer
[DEBUG] main com.jcabi.log.VerboseProcess: #start(): cat /non-existing-file.txt
[DEBUG] main com.jcabi.log.VerboseProcess: #waitFor(): waiting for stdout of Process[pid=250, exitValue=1] in Thread[#26,VrbPrc.Monitor-1786872722-out,5,main]...
[DEBUG] main com.jcabi.log.VerboseProcess: #waitFor(): waiting for stderr of Process[pid=250, exitValue=1] in Thread[#27,VrbPrc.Monitor-1786872722-err,5,main]...
[DEBUG] main com.jcabi.log.VerboseProcess: #waitFor(): process finished: Process[pid=250, exitValue=1]
[INFO] VrbPrc.Monitor-1786872722-out com.jcabi.log.VerboseProcess: >> cat: /non-existing-file.txt: No such file or directory
[DEBUG] main com.jcabi.log.VerboseProcess: #stdout(): process Process[pid=250, exitValue=1] completed (code=1, size=55) in 4ms
[DEBUG] main com.jcabi.log.VerboseProcess: Monitor interrupted
[DEBUG] main com.jcabi.log.VerboseProcess: Monitor interrupted
[DEBUG] main com.jcabi.log.VerboseProcess: Underlying process destroyed
Exception in thread "VrbPrc.Monitor-1786872722-err" java.lang.IllegalStateException: The thread has been interrupted
        at com.jcabi.log.VerboseRunnable.run(VerboseRunnable.java:187)
        at java.base/java.lang.Thread.run(Thread.java:1583)
[DEBUG] main com.jcabi.log.VerboseProcessTest: #logsErrorWhenUnderlyingStreamIsClosed(): vrbPrc.hashCode=365211514
[DEBUG] main com.jcabi.log.VerboseProcess: #waitFor(): waiting for stdout of Mock for Process, hashCode: 501855493 in Thread[#28,VrbPrc.Monitor-365211514-out,5,main]...
[ERROR] VrbPrc.Monitor-365211514-out com.jcabi.log.VerboseProcess: Error reading from process stream: java.nio.channels.ClosedChannelException
        at java.base/sun.nio.ch.FileChannelImpl.ensureOpen(FileChannelImpl.java:160)
        at java.base/sun.nio.ch.FileChannelImpl.read(FileChannelImpl.java:218)
        at java.base/sun.nio.ch.ChannelInputStream.read(ChannelInputStream.java:74)
        at java.base/sun.nio.ch.ChannelInputStream.read(ChannelInputStream.java:103)
        at java.base/java.nio.channels.Channels$ReadableByteChannelImpl.read(Channels.java:316)
        at java.base/sun.nio.cs.StreamDecoder.readBytes(StreamDecoder.java:341)
        at java.base/sun.nio.cs.StreamDecoder.implRead(StreamDecoder.java:393)
        at java.base/sun.nio.cs.StreamDecoder.lockedRead(StreamDecoder.java:217)
        at java.base/sun.nio.cs.StreamDecoder.read(StreamDecoder.java:177)
        at java.base/java.io.BufferedReader.fill(BufferedReader.java:160)
        at java.base/java.io.BufferedReader.implReadLine(BufferedReader.java:370)
        at java.base/java.io.BufferedReader.readLine(BufferedReader.java:353)
        at java.base/java.io.BufferedReader.readLine(BufferedReader.java:436)
        at com.jcabi.log.Monitor.call(Monitor.java:83)
        at com.jcabi.log.Monitor.call(Monitor.java:25)
        at com.jcabi.log.VerboseRunnable$1.run(VerboseRunnable.java:104)
        at com.jcabi.log.VerboseRunnable.run(VerboseRunnable.java:169)
        at java.base/java.lang.Thread.run(Thread.java:1583)

[DEBUG] main com.jcabi.log.VerboseProcess: #waitFor(): waiting for stderr of Mock for Process, hashCode: 501855493 in Thread[#29,VrbPrc.Monitor-365211514-err,5,main]...
[DEBUG] main com.jcabi.log.VerboseProcess: #waitFor(): process finished: Mock for Process, hashCode: 501855493
[DEBUG] main com.jcabi.log.VerboseProcess: #stdout(): process Mock for Process, hashCode: 501855493 completed (code=0, size=0) in 7ms
[DEBUG] main com.jcabi.log.VerboseProcess: Monitor interrupted
[DEBUG] main com.jcabi.log.VerboseProcess: Monitor interrupted
[DEBUG] main com.jcabi.log.VerboseProcess: Underlying process destroyed
[DEBUG] main com.jcabi.log.VerboseProcess: #start(): cat /non-existing-file-hello dear friend
Exception in thread "VrbPrc.Monitor-365211514-err" java.lang.IllegalStateException: The thread has been interrupted
        at com.jcabi.log.VerboseRunnable.run(VerboseRunnable.java:187)
        at java.base/java.lang.Thread.run(Thread.java:1583)
[DEBUG] main com.jcabi.log.VerboseProcess: #waitFor(): waiting for stdout of Process[pid=255, exitValue=1] in Thread[#30,VrbPrc.Monitor-430329518-out,5,main]...
[DEBUG] main com.jcabi.log.VerboseProcess: #waitFor(): waiting for stderr of Process[pid=255, exitValue=1] in Thread[#31,VrbPrc.Monitor-430329518-err,5,main]...
[DEBUG] main com.jcabi.log.VerboseProcess: #waitFor(): process finished: Process[pid=255, exitValue=1]
[WARN] VrbPrc.Monitor-430329518-err com.jcabi.log.VerboseProcess: >> cat: '/non-existing-file-hello dear friend ': No such file or directory
[DEBUG] main com.jcabi.log.VerboseProcess: #stdout(): process Process[pid=255, exitValue=1] completed (code=1, size=0) in 4ms
[DEBUG] main com.jcabi.log.VerboseProcess: Monitor interrupted
[DEBUG] main com.jcabi.log.VerboseProcess: Monitor interrupted
[DEBUG] main com.jcabi.log.VerboseProcess: Underlying process destroyed
[DEBUG] main com.jcabi.log.VerboseProcess: #start(): cat /non-existing-file.txt
Exception in thread "VrbPrc.Monitor-430329518-err" java.lang.IllegalStateException: The thread has been interrupted
        at com.jcabi.log.VerboseRunnable.run(VerboseRunnable.java:187)
        at java.base/java.lang.Thread.run(Thread.java:1583)
[DEBUG] main com.jcabi.log.VerboseProcess: #waitFor(): waiting for stdout of Process[pid=258, exitValue=1] in Thread[#32,VrbPrc.Monitor-765702264-out,5,main]...
[DEBUG] main com.jcabi.log.VerboseProcess: #waitFor(): waiting for stderr of Process[pid=258, exitValue=1] in Thread[#33,VrbPrc.Monitor-765702264-err,5,main]...
[DEBUG] main com.jcabi.log.VerboseProcess: #waitFor(): process finished: Process[pid=258, exitValue=1]
[WARN] VrbPrc.Monitor-765702264-err com.jcabi.log.VerboseProcess: >> cat: /non-existing-file.txt: No such file or directory
[DEBUG] main com.jcabi.log.VerboseProcess: Monitor interrupted
[DEBUG] main com.jcabi.log.VerboseProcess: Monitor interrupted
[DEBUG] main com.jcabi.log.VerboseProcess: Underlying process destroyed
[DEBUG] main com.jcabi.log.VerboseProcess: #start(): /bin/bash -c sleep 2; echo 'done'
Exception in thread "VrbPrc.Monitor-765702264-err" java.lang.IllegalStateException: The thread has been interrupted
        at com.jcabi.log.VerboseRunnable.run(VerboseRunnable.java:187)
        at java.base/java.lang.Thread.run(Thread.java:1583)
[DEBUG] main com.jcabi.log.VerboseProcess: #waitFor(): waiting for stdout of Process[pid=261, exitValue="not exited"] in Thread[#34,VrbPrc.Monitor-2142660176-out,5,main]...
[DEBUG] main com.jcabi.log.VerboseProcess: #waitFor(): waiting for stderr of Process[pid=261, exitValue="not exited"] in Thread[#35,VrbPrc.Monitor-2142660176-err,5,main]...
[INFO] VrbPrc.Monitor-2142660176-out com.jcabi.log.VerboseProcess: >> done
[DEBUG] main com.jcabi.log.VerboseProcess: #waitFor(): process finished: Process[pid=261, exitValue=0]
[DEBUG] main com.jcabi.log.VerboseProcess: #stdout(): process Process[pid=261, exitValue=0] completed (code=0, size=5) in 2s
[DEBUG] main com.jcabi.log.VerboseProcess: Monitor interrupted
[DEBUG] main com.jcabi.log.VerboseProcess: Monitor interrupted
[DEBUG] main com.jcabi.log.VerboseProcess: Underlying process destroyed
[DEBUG] main com.jcabi.log.VerboseProcess: Underlying process destroyed
[DEBUG] Thread-17 com.jcabi.log.VerboseProcess: #waitFor(): process finished: Process[pid=265, exitValue=143]
[DEBUG] Thread-17 com.jcabi.log.VerboseProcess: #stdout(): process Process[pid=265, exitValue=143] completed (code=143, size=0) in 0ms
[WARNING] Tests run: 14, Failures: 0, Errors: 0, Skipped: 2, Time elapsed: 12.80 s -- in com.jcabi.log.VerboseProcessTest
[INFO] Running com.jcabi.log.LineNumberTest
[INFO] main com.jcabi.log.LineNumberTest: Test
[INFO] Tests run: 1, Failures: 0, Errors: 0, Skipped: 0, Time elapsed: 0.027 s -- in com.jcabi.log.LineNumberTest
[INFO] Running com.jcabi.log.ParseableLevelInformationTest
[INFO] Tests run: 3, Failures: 0, Errors: 0, Skipped: 0, Time elapsed: 0.022 s -- in com.jcabi.log.ParseableLevelInformationTest
[INFO] Running com.jcabi.log.MulticolorLayoutTest
[INFO] Tests run: 6, Failures: 0, Errors: 0, Skipped: 0, Time elapsed: 0.214 s -- in com.jcabi.log.MulticolorLayoutTest
[INFO] Running com.jcabi.log.DomDecorTest
[INFO] Tests run: 2, Failures: 0, Errors: 0, Skipped: 0, Time elapsed: 0.153 s -- in com.jcabi.log.DomDecorTest
[INFO] Running com.jcabi.log.VerboseThreadsTest
[WARN] foo-1 com.jcabi.log.Wrap: foo-1: java.lang.IllegalArgumentException: oops
        at com.jcabi.log.VerboseThreadsTest.lambda$instantiatesThreadsOnDemand$0(VerboseThreadsTest.java:30)
        at java.base/java.util.concurrent.ThreadPoolExecutor.runWorker(ThreadPoolExecutor.java:1144)
        at java.base/java.util.concurrent.ThreadPoolExecutor$Worker.run(ThreadPoolExecutor.java:642)
        at com.jcabi.log.Wrap.run(Wrap.java:32)
        at java.base/java.lang.Thread.run(Thread.java:1583)

[WARN] foo-1 com.jcabi.log.VerboseThreads: java.lang.IllegalArgumentException: oops
        at com.jcabi.log.VerboseThreadsTest.lambda$instantiatesThreadsOnDemand$0(VerboseThreadsTest.java:30)
        at java.base/java.util.concurrent.ThreadPoolExecutor.runWorker(ThreadPoolExecutor.java:1144)
        at java.base/java.util.concurrent.ThreadPoolExecutor$Worker.run(ThreadPoolExecutor.java:642)
        at com.jcabi.log.Wrap.run(Wrap.java:32)
        at java.base/java.lang.Thread.run(Thread.java:1583)

[INFO] Tests run: 2, Failures: 0, Errors: 0, Skipped: 0, Time elapsed: 2.026 s -- in com.jcabi.log.VerboseThreadsTest
[INFO] Running com.jcabi.log.TypeDecorTest
[INFO] Tests run: 6, Failures: 0, Errors: 0, Skipped: 0, Time elapsed: 0.052 s -- in com.jcabi.log.TypeDecorTest
[INFO] Running com.jcabi.log.DecorsManagerTest
[INFO] Tests run: 2, Failures: 0, Errors: 0, Skipped: 0, Time elapsed: 0.012 s -- in com.jcabi.log.DecorsManagerTest
[INFO]
[INFO] Results:
[INFO]
[INFO] Tests run: 218, Failures: 0, Errors: 0, Skipped: 6
[INFO]
[INFO]
[INFO] --- jcabi:0.17.0:versionalize (jcabi-versionalize-packages) @ jcabi-log ---
[INFO] Versionalizing /home/r/repo/target/classes directory
[INFO] File /home/r/repo/target/classes/com/jcabi/log/com-jcabi-jcabi-log-bundle.txt added
[INFO]
[INFO] --- bundle:6.1.0:bundle (default-bundle) @ jcabi-log ---
[INFO] Building bundle: /home/r/repo/target/jcabi-log-1.0-SNAPSHOT.jar
[INFO] Writing manifest: /home/r/repo/target/classes/META-INF/MANIFEST.MF
[INFO]
[INFO] --- assembly:3.8.0:single (assemble-all) @ jcabi-log ---
[INFO] Artifact log4j:log4j:pom:1.2.17 is present in the local repository, but cached from a remote repository ID that is unavailable in current build context, verifying that is downloadable from [central (https://repo.maven.apache.org/maven2, default, releases)]
[INFO] Artifact log4j:log4j:pom:1.2.17 is present in the local repository, but cached from a remote repository ID that is unavailable in current build context, verifying that is downloadable from [central (https://repo.maven.apache.org/maven2, default, releases)]
[INFO] Building jar: /home/r/repo/target/jcabi-log-1.0-SNAPSHOT-jar-with-dependencies.jar
[INFO]
[INFO] --- invoker:3.10.1:install (default) @ jcabi-log ---
[INFO] Installing /home/r/repo/target/jcabi-log-1.0-SNAPSHOT.jar to /home/r/repo/target/local-repo/com/jcabi/jcabi-log/1.0-SNAPSHOT/jcabi-log-1.0-SNAPSHOT.jar
[INFO] Installing /home/r/repo/target/jcabi-log-1.0-SNAPSHOT-jar-with-dependencies.jar to /home/r/repo/target/local-repo/com/jcabi/jcabi-log/1.0-SNAPSHOT/jcabi-log-1.0-SNAPSHOT-jar-with-dependencies.jar
[INFO] Installing /home/r/repo/pom.xml to /home/r/repo/target/local-repo/com/jcabi/jcabi-log/1.0-SNAPSHOT/jcabi-log-1.0-SNAPSHOT.pom
[INFO] Installing /home/r/.m2/repository/com/jcabi/jcabi/1.45.0/jcabi-1.45.0.pom to /home/r/repo/target/local-repo/com/jcabi/jcabi/1.45.0/jcabi-1.45.0.pom
[INFO] Installing /home/r/.m2/repository/com/jcabi/parent/0.73.3/parent-0.73.3.pom to /home/r/repo/target/local-repo/com/jcabi/parent/0.73.3/parent-0.73.3.pom
[INFO] Installing /home/r/.m2/repository/log4j/log4j/1.2.17/log4j-1.2.17.jar to /home/r/repo/target/local-repo/log4j/log4j/1.2.17/log4j-1.2.17.jar
[INFO] Installing /home/r/.m2/repository/log4j/log4j/1.2.17/log4j-1.2.17.pom to /home/r/repo/target/local-repo/log4j/log4j/1.2.17/log4j-1.2.17.pom
[INFO] Installing /home/r/.m2/repository/org/slf4j/slf4j-api/2.0.20/slf4j-api-2.0.20.jar to /home/r/repo/target/local-repo/org/slf4j/slf4j-api/2.0.20/slf4j-api-2.0.20.jar
[INFO] Installing /home/r/.m2/repository/org/slf4j/slf4j-api/2.0.20/slf4j-api-2.0.20.pom to /home/r/repo/target/local-repo/org/slf4j/slf4j-api/2.0.20/slf4j-api-2.0.20.pom
[INFO] Installing /home/r/.m2/repository/org/slf4j/slf4j-bom/2.0.20/slf4j-bom-2.0.20.pom to /home/r/repo/target/local-repo/org/slf4j/slf4j-bom/2.0.20/slf4j-bom-2.0.20.pom
[INFO] Installing /home/r/.m2/repository/org/slf4j/slf4j-parent/2.0.20/slf4j-parent-2.0.20.pom to /home/r/repo/target/local-repo/org/slf4j/slf4j-parent/2.0.20/slf4j-parent-2.0.20.pom
[INFO]
[INFO] --- invoker:3.10.1:run (default) @ jcabi-log ---
[INFO] Building: it-decoloring/pom.xml
[INFO]           it-decoloring/pom.xml ............................ SUCCESS (15.47 s)
[INFO] -------------------------------------------------
[INFO] Build Summary:
[INFO]   Passed: 1, Failed: 0, Errors: 0, Skipped: 0
[INFO] -------------------------------------------------
[INFO]
[INFO] --- qulice:0.36.0:check (jcabi-qulice-check) @ jcabi-log ---
[INFO] Calling org.apache.maven.plugins:maven-enforcer-plugin:3.1.0:enforce...
[INFO] Calling org.basepom.maven:duplicate-finder-maven-plugin:2.0.1:check...
[INFO] Checking compile classpath
[INFO] Checking runtime classpath
[INFO] No dependency problems found
[INFO] Qulice checked 66 .java files against 1020 rules (243 Checkstyle, 284 PMD, 493 ErrorProne) in 38s
[INFO]
[INFO] --- install:3.1.4:install (default-install) @ jcabi-log ---
[INFO] Installing /home/r/repo/pom.xml to /home/r/.m2/repository/com/jcabi/jcabi-log/1.0-SNAPSHOT/jcabi-log-1.0-SNAPSHOT.pom
[INFO] Installing /home/r/repo/target/jcabi-log-1.0-SNAPSHOT.jar to /home/r/.m2/repository/com/jcabi/jcabi-log/1.0-SNAPSHOT/jcabi-log-1.0-SNAPSHOT.jar
[INFO] Installing /home/r/repo/target/jcabi-log-1.0-SNAPSHOT-jar-with-dependencies.jar to /home/r/.m2/repository/com/jcabi/jcabi-log/1.0-SNAPSHOT/jcabi-log-1.0-SNAPSHOT-jar-with-dependencies.jar
[INFO]
[INFO] --- bundle:6.1.0:install (default-install) @ jcabi-log ---
[INFO] Writing OBR metadata
[INFO] Installing com/jcabi/jcabi-log/1.0-SNAPSHOT/jcabi-log-1.0-SNAPSHOT.jar
[INFO] Installing com/jcabi/jcabi-log/1.0-SNAPSHOT/jcabi-log-1.0-SNAPSHOT-jar-with-dependencies.jar
[INFO] Writing OBR metadata
[INFO] ------------------------------------------------------------------------
[INFO] BUILD SUCCESS
[INFO] ------------------------------------------------------------------------
[INFO] Total time:  02:02 min
[INFO] Finished at: 2026-09-26T03:40:54Z
[INFO] ------------------------------------------------------------------------
0m0m+ mv /home/r/repo .
++ whoami
+ chown -R root repo
+ '[' -n '' ']'
++ whoami
+ sudo chown -R ubuntu repo
+ cd repo
+ git push origin master
remote:
remote: GitHub found 6 vulnerabilities on jcabi/jcabi-log's default branch (3 critical, 3 high). To find out more, visit:
remote:      https://github.com/jcabi/jcabi-log/security/dependabot
remote:
To github.com:jcabi/jcabi-log.git
   201dc4e..003f938  master -> master
container 9a0d2339008ecab6e6c1aebabe19e4847497c0287e50906c0efd732988793dee is dead
Sat Sep 26 03:53:49 UTC 2026